{"text_format":"1","workbook":"xlsx","n_sheets":6,"sheets":["1_Summary MSMF V.1. Final","2_Stream Impact Calculator","3_Stream Mit Calc_StrmChannels","4_Stream Mitigation-Buffers","5_Bundled StreamChannel Mit ","6_Bundled Stream Mit-Buffers "],"not_rendered":{"charts":0,"images":1,"macros":0,"external_links":0,"defined_names":0,"comments":0,"pivot_tables":0},"unopened":[],"bounds":{"document_bytes":16777216,"sheet_cells":100000,"rows_first":2000,"rows_last":500,"rows_between":2000,"halvings":0,"cell_chars":16384,"cell_head_chars":4096},"cells_cut":0,"cells_raw":0,"read":"whole","date_system":"1900"}

{"sheet":"1_Summary MSMF V.1. Final","index":0,"n_rows":54,"n_cols":9,"rows_kept":54,"cut":false,"hidden":false,"merged":[[41,0,41,4],[33,0,36,4],[17,0,17,5],[17,6,17,11],[53,0,106,11],[41,5,41,7],[52,0,52,11],[51,0,51,4],[51,5,51,7],[19,0,22,11],[23,0,23,11],[42,0,42,11],[37,8,40,11],[37,0,40,4],[37,5,40,7],[43,0,46,4],[43,5,46,7],[43,8,46,11],[47,0,50,4],[47,5,50,7],[47,8,50,11],[33,5,36,7],[24,0,24,4],[25,0,28,4],[29,0,32,4],[33,8,36,11],[24,8,24,11],[25,8,28,11],[29,8,32,11],[29,5,32,7],[18,0,18,11],[16,0,16,1],[16,2,16,5],[24,5,24,7],[25,5,28,7],[14,6,14,7],[14,8,14,11],[16,6,16,7],[16,8,16,11],[13,0,13,1],[13,2,13,5],[14,0,14,1],[14,2,14,5],[13,6,13,7],[13,8,13,11],[15,2,15,5],[15,6,15,7],[15,8,15,11],[12,0,12,1],[10,6,10,7],[11,6,11,7],[11,0,11,1],[0,0,8,11],[10,0,10,1],[9,0,9,5],[9,6,9,11],[10,8,10,11],[11,8,11,11],[12,8,12,11],[10,2,10,5],[11,2,11,5],[12,2,12,5],[12,6,12,7]]}
["THE MARYLAND STREAM MITIGATION FRAMEWORK VERSION 1 FINAL (MSMF V.1. FINAL) 1,2,6,7"]
[]
[]
[]
[]
[]
[]
[]
[]
["BACKGROUND-IMPACTS",null,null,null,null,null,"BACKGROUND-MITIGATION "]
["Corps Project ID #:",null,"NAB-2023-85656",null,null,null,"Corps Project ID #:",null,"NAB-2023-88552"]
["Project Name:",null,"Acme Airport Runway Expansion",null,null,null,"Project Name:",null,"Panther Branch Mitigation"]
["County:",null,"Baltimore ",null,null,null,"County:",null,"Baltimore "]
["Corps PM:",null,"James Brown",null,null,null,"Corps PM:",null,"James Brown"]
["Sponsor:",null,"Acme Airports",null,null,null,"Sponsor:",null,"NA"]
["Landowner(s):",null,"Acme Airports",null,null,null,"Landowner(s):",null,"Bob Smith"]
["Collaborators: ",null,"GKH, JMB, CTT",null,null,null,"Collaborators: ",null,"BTD, MPT"]
["MITIGATION  TYPE",null,null,null,null,null,"Permittee Responsible"]
["SUMMARY"]
["This example illustrates impacts for a proposed airport and associated permitee responsible mitigation.  Only Tabs 1, 2, 3, and 4 were needed. The numbers below auto populate.  For impacts purchasing from a mitigation bank, only tabs 1 and 2 would be completed, while the bank would independently have their own workbook with tabs 1 and some combination of 3, 4, 5, 6, and/or Fish Passage dependent on their proposal.   "]
[]
[]
[]
["TALLY OF IMPACTS AND MITIGATION"]
["CALCULATION NAME",null,null,null,null,"FUNCTIONAL FEET (FF)",null,null,"SUMMARY"]
["STREAM IMPACTS TOTAL",null,null,null,null,{"$f":"SUM('2_Stream Impact Calculator'!N11:N126)","v":-909.88736354577441}]
[]
[]
[]
["STREAM MITIGATION TOTAL FOR STREAM CHANNELS",null,null,null,null,{"$f":"SUM('3_Stream Mit Calc_StrmChannels'!P11:P86)","v":693.41631250917646}]
[]
[]
[]
["STREAM MITIGATION TOTAL FOR STREAM BUFFERS",null,null,null,null,{"$f":"SUM('4_Stream Mitigation-Buffers'!M11:M64)","v":216.5625}]
[]
[]
[]
["STREAM MITIGATION TOTAL FOR        FISH PASSAGE3",null,null,null,null,0]
[]
[]
[]
["FUNCTIONAL FOOT BALANCE4 ",null,null,null,null,{"$f":"SUM(F26:H41)","v":9.1448963402058325E-2}]
["TALLY OF BUNDLED MITIGATION (for Mitigation Banks Only) 5"]
["STREAM MITIGATION TOTAL FOR STREAM CHANNELS (bundled)",null,null,null,null,{"$f":"SUM(#REF!)","v":{"$error":"#REF!"}},null,null,"list ratio and bundled type"]
[]
[]
[]
["STREAM MITIGATION TOTAL FOR STREAM BUFFERS (bundled)",null,null,null,null,{"$f":"SUM(#REF!)","v":{"$error":"#REF!"}},null,null,"list ratio and bundled type"]
[]
[]
[]
["OPTIONAL FUNCTIONAL FEET",null,null,null,null,{"$f":"SUM(F44:H51)","v":{"$error":"#REF!"}}]
["NOTES                                                                                                                                                                                                                     "]
["                                                                                                                                                                                                                                 1 The MSMF V.1. Final Calculator includes ten tabs including six different worksheets which populate this summary sheet. Each worksheet and associated instructions are color coded.                                                                                                                                      Tab 1:MSMF V.1. Summary                                                                                                                                                                                                                                                                                                              Tab 2: Stream Impact Calculator                                                                                                                                                                                                                                                                                                                           Tab 3: Stream Mitigation Calcualtor for stream channels                                                                                                                                                                                                                                                                            Tab 4: Stream Mitigation Calculator for Buffers                                                                                                                                                                                                                                                                         Tab 5: Bundled Stream Channel Mitigation (FOR MITIGATION BANKS ONLY)                                                                                                                                                 Tab 6: Bundled Stream Buffer Mitigation (FOR MITIGTION BANKS ONLY)                                                                                                                                                                                     2   Please note that  for most projects only 1-4 worksheets will need to be filed out.  For projects involving only stream impacts and purchasing credits from a mitigation bank, only the Summary Sheet and Stream Impact Calculator must be completed.  The Stream Mitigation Calculators will be filled out by the Mitigation Bank Sponsor. For Impacts with permittee responsible mitigation, the Stream Impact Calculator, Stream Mitigation Calculator, and Stream Mitigation-Buffers Calculator must be completed.                                                                                                                                                  3  If mitigation credits are sought for fish passage, the  Stream Mitigation Total for Fish Passage must be entered manually using the MSMF Fish Passage Bete Tool.  It will be released as a separate workbook in late 2023.                                                                                                                                                    4   Please note that on permitee responsible mitigation, excess credit balance may not be sold or used to mitigate other DA authorized impacts.  Only approved mitigation banks and In Lieu Fee Programs may sell excess functional foot credits.                                                                                                                           5  The \"Bundled\" credits sheets are only for complex mitigation banks where credits overlap other credits or programs (e.g. Stream Buffers and Wetlands) where the sponsor must choose which credit to sell during each credit release year, resulting in diminishing credits in both categories for that release year.                            6  Where impacts involve high quality resources or sensitive areas, the Corps reserves the ability to adjust debit and credit calculations accordingly.                                                                                                   7This tool does not circumvent Corps permit application reviews or interfere with the ability of Corps or MDE reviewers to determine mitigation credits owed for stream impacts or mitigation credits awarded for  mitigation efforts should the output of this tool be contrary to their professional judgement and/or state or federal regulations.  "]

{"sheet":"2_Stream Impact Calculator","index":1,"n_rows":126,"n_cols":15,"rows_kept":126,"cut":false,"hidden":false,"merged":[[94,13,97,13],[94,14,97,18],[90,13,93,13],[90,14,93,18],[86,13,89,13],[86,14,89,18],[122,14,125,18],[110,13,113,13],[110,14,113,18],[106,13,109,13],[106,14,109,18],[102,13,105,13],[102,14,105,18],[98,13,101,13],[98,14,101,18],[118,13,121,13],[122,13,125,13],[124,1,125,1],[124,2,125,2],[124,3,125,3],[124,4,125,4],[124,5,125,5],[124,6,125,6],[124,9,125,9],[124,11,125,11],[122,1,123,1],[122,2,123,2],[122,3,123,3],[122,4,123,4],[122,5,123,5],[122,6,123,6],[122,9,123,9],[122,10,125,10],[120,2,121,2],[120,3,121,3],[120,4,121,4],[120,5,121,5],[120,6,121,6],[120,9,121,9],[120,11,121,11],[118,1,119,1],[118,2,119,2],[118,3,119,3],[118,4,119,4],[118,5,119,5],[118,6,119,6],[118,9,119,9],[118,10,121,10],[112,11,113,11],[122,0,125,0],[114,13,117,13],[114,14,117,18],[116,1,117,1],[116,2,117,2],[116,3,117,3],[116,4,117,4],[116,5,117,5],[116,6,117,6],[116,9,117,9],[116,11,117,11],[114,0,117,0],[114,1,115,1],[114,2,115,2],[114,3,115,3],[114,4,115,4],[114,5,115,5],[114,6,115,6],[114,9,115,9],[114,10,117,10],[118,0,121,0],[118,14,121,18],[120,1,121,1],[110,0,113,0],[110,1,111,1],[110,2,111,2],[110,3,111,3],[110,4,111,4],[110,5,111,5],[110,6,111,6],[110,9,111,9],[110,10,113,10],[112,1,113,1],[112,2,113,2],[112,3,113,3],[112,4,113,4],[112,5,113,5],[112,6,113,6],[112,9,113,9],[104,11,105,11],[106,0,109,0],[106,1,107,1],[106,2,107,2],[106,3,107,3],[106,4,107,4],[106,5,107,5],[106,6,107,6],[106,9,107,9],[106,10,109,10],[108,1,109,1],[108,2,109,2],[108,3,109,3],[108,4,109,4],[108,5,109,5],[108,6,109,6],[108,9,109,9],[108,11,109,11],[102,0,105,0],[102,1,103,1],[102,2,103,2],[102,3,103,3],[102,4,103,4],[102,5,103,5],[102,6,103,6],[102,9,103,9],[102,10,105,10],[104,1,105,1],[104,2,105,2],[104,3,105,3],[104,4,105,4],[104,5,105,5],[104,6,105,6],[104,9,105,9],[96,11,97,11],[98,0,101,0],[98,1,99,1],[98,2,99,2],[98,3,99,3],[98,4,99,4],[98,5,99,5],[98,6,99,6],[98,9,99,9],[98,10,101,10],[100,1,101,1],[100,2,101,2],[100,3,101,3],[100,4,101,4],[100,5,101,5],[100,6,101,6],[100,9,101,9],[100,11,101,11],[94,0,97,0],[94,1,95,1],[94,2,95,2],[94,3,95,3],[94,4,95,4],[94,5,95,5],[94,6,95,6],[94,9,95,9],[94,10,97,10],[96,1,97,1],[96,2,97,2],[96,3,97,3],[96,4,97,4],[96,5,97,5],[96,6,97,6],[96,9,97,9],[88,11,89,11],[90,0,93,0],[90,1,91,1],[90,2,91,2],[90,3,91,3],[90,4,91,4],[90,5,91,5],[90,6,91,6],[90,9,91,9],[90,10,93,10],[92,1,93,1],[92,2,93,2],[92,3,93,3],[92,4,93,4],[92,5,93,5],[92,6,93,6],[92,9,93,9],[92,11,93,11],[86,0,89,0],[86,1,87,1],[86,2,87,2],[86,3,87,3],[86,4,87,4],[86,5,87,5],[86,6,87,6],[86,9,87,9],[86,10,89,10],[88,1,89,1],[88,2,89,2],[88,3,89,3],[88,4,89,4],[88,5,89,5],[88,6,89,6],[88,9,89,9],[82,13,85,13],[82,14,85,18],[84,1,85,1],[84,2,85,2],[84,3,85,3],[84,4,85,4],[84,5,85,5],[84,6,85,6],[84,9,85,9],[84,11,85,11],[83,12,84,12],[82,0,85,0],[82,1,83,1],[82,2,83,2],[82,3,83,3],[82,4,83,4],[82,5,83,5],[82,6,83,6],[82,9,83,9],[82,10,85,10],[78,13,81,13],[78,14,81,18],[80,1,81,1],[80,2,81,2],[80,3,81,3],[80,4,81,4],[80,5,81,5],[80,6,81,6],[80,9,81,9],[80,11,81,11],[79,12,80,12],[78,0,81,0],[78,1,79,1],[78,2,79,2],[78,3,79,3],[78,4,79,4],[78,5,79,5],[78,6,79,6],[78,9,79,9],[78,10,81,10],[74,13,77,13],[74,14,77,18],[76,1,77,1],[76,2,77,2],[76,3,77,3],[76,4,77,4],[76,5,77,5],[76,6,77,6],[76,9,77,9],[76,11,77,11],[75,12,76,12],[74,0,77,0],[74,1,75,1],[74,2,75,2],[74,3,75,3],[74,4,75,4],[74,5,75,5],[74,6,75,6],[74,9,75,9],[74,10,77,10],[70,13,73,13],[70,14,73,18],[72,1,73,1],[72,2,73,2],[72,3,73,3],[72,4,73,4],[72,5,73,5],[72,6,73,6],[72,9,73,9],[72,11,73,11],[71,12,72,12],[70,0,73,0],[70,1,71,1],[70,2,71,2],[70,3,71,3],[70,4,71,4],[70,5,71,5],[70,6,71,6],[70,9,71,9],[70,10,73,10],[66,13,69,13],[66,14,69,18],[68,1,69,1],[68,2,69,2],[68,3,69,3],[68,4,69,4],[68,5,69,5],[68,6,69,6],[68,9,69,9],[68,11,69,11],[67,12,68,12],[66,0,69,0],[66,1,67,1],[66,2,67,2],[66,3,67,3],[66,4,67,4],[66,5,67,5],[66,6,67,6],[66,9,67,9],[66,10,69,10],[54,13,57,13],[54,14,57,18],[56,1,57,1],[56,2,57,2],[56,3,57,3],[56,4,57,4],[56,5,57,5],[56,6,57,6],[56,9,57,9],[56,11,57,11],[54,0,57,0],[54,1,55,1],[54,2,55,2],[54,3,55,3],[54,4,55,4],[54,5,55,5],[54,6,55,6],[54,9,55,9],[54,10,57,10],[38,13,41,13],[40,2,41,2],[40,3,41,3],[40,4,41,4],[40,5,41,5],[40,6,41,6],[40,9,41,9],[40,11,41,11],[46,13,49,13],[48,2,49,2],[48,3,49,3],[48,4,49,4],[48,5,49,5],[48,6,49,6],[48,9,49,9],[48,11,49,11],[46,6,47,6],[46,9,47,9],[46,10,49,10],[42,9,43,9],[42,10,45,10],[42,13,45,13],[38,9,39,9],[18,6,19,6],[14,5,15,5],[32,6,33,6],[22,5,23,5],[22,6,23,6],[34,4,35,4],[36,4,37,4],[24,5,25,5],[30,10,33,10],[26,5,27,5],[36,9,37,9],[26,10,29,10],[26,9,27,9],[32,9,33,9],[30,5,31,5],[30,6,31,6],[14,4,15,4],[28,4,29,4],[0,0,1,18],[2,0,2,10],[4,5,4,6],[4,7,4,10],[5,5,5,6],[5,7,5,10],[6,5,6,6],[6,7,6,10],[2,11,6,13],[2,14,6,18],[3,5,3,6],[3,7,3,10],[3,0,3,1],[4,0,4,1],[5,0,5,1],[6,0,6,1],[3,2,3,4],[4,2,4,4],[5,2,5,4],[6,2,6,4],[34,13,37,13],[10,13,13,13],[14,13,17,13],[18,13,21,13],[22,13,25,13],[26,13,29,13],[30,13,33,13],[10,9,11,9],[12,9,13,9],[36,11,37,11],[12,11,13,11],[16,11,17,11],[20,11,21,11],[28,9,29,9],[34,10,37,10],[34,9,35,9],[28,11,29,11],[10,10,13,10],[14,9,15,9],[22,9,23,9],[24,9,25,9],[24,11,25,11],[32,11,33,11],[30,9,31,9],[32,1,33,1],[26,4,27,4],[24,2,25,2],[18,3,19,3],[14,0,17,0],[14,2,15,2],[14,3,15,3],[16,4,17,4],[18,4,19,4],[20,4,21,4],[30,2,31,2],[30,3,31,3],[30,4,31,4],[26,0,29,0],[26,2,27,2],[26,3,27,3],[22,0,25,0],[22,2,23,2],[22,3,23,3],[24,3,25,3],[10,14,13,18],[14,14,17,18],[18,14,21,18],[22,14,25,18],[26,14,29,18],[10,0,13,0],[10,3,11,3],[12,3,13,3],[12,2,13,2],[12,5,13,5],[10,2,11,2],[10,5,11,5],[12,6,13,6],[10,4,11,4],[12,4,13,4],[14,6,15,6],[16,9,17,9],[14,10,17,10],[18,9,19,9],[20,9,21,9],[18,5,19,5],[18,10,21,10],[18,0,21,0],[18,2,19,2],[34,14,37,18],[16,2,17,2],[16,3,17,3],[16,5,17,5],[16,6,17,6],[10,6,11,6],[20,2,21,2],[20,3,21,3],[20,5,21,5],[20,6,21,6],[22,10,25,10],[24,6,25,6],[22,4,23,4],[24,4,25,4],[28,2,29,2],[28,3,29,3],[28,5,29,5],[28,6,29,6],[26,6,27,6],[30,14,33,18],[32,2,33,2],[32,3,33,3],[32,4,33,4],[32,5,33,5],[50,13,53,13],[52,2,53,2],[52,3,53,3],[52,4,53,4],[52,5,53,5],[52,6,53,6],[52,9,53,9],[52,11,53,11],[7,0,7,10],[7,11,7,12],[8,0,9,0],[8,2,9,2],[8,3,9,3],[8,5,9,5],[8,6,9,6],[8,7,9,7],[8,12,9,12],[8,4,9,4],[8,11,9,11],[8,8,9,8],[8,9,9,9],[8,10,9,10],[30,0,33,0],[30,1,31,1],[62,9,63,9],[62,10,65,10],[62,13,65,13],[64,2,65,2],[64,3,65,3],[64,4,65,4],[64,5,65,5],[64,6,65,6],[64,9,65,9],[64,11,65,11],[63,12,64,12],[7,14,9,18],[7,13,9,13],[38,14,41,18],[46,14,49,18],[50,14,53,18],[62,14,65,18],[8,1,9,1],[10,1,11,1],[12,1,13,1],[14,1,15,1],[16,1,17,1],[18,1,19,1],[20,1,21,1],[22,1,23,1],[24,1,25,1],[26,1,27,1],[28,1,29,1],[38,1,39,1],[40,1,41,1],[46,1,47,1],[48,1,49,1],[50,1,51,1],[62,3,63,3],[62,4,63,4],[62,0,65,0],[62,2,63,2],[58,0,61,0],[58,1,59,1],[58,2,59,2],[58,3,59,3],[58,4,59,4],[58,5,59,5],[58,6,59,6],[62,1,63,1],[64,1,65,1],[62,5,63,5],[62,6,63,6],[52,1,53,1],[50,0,53,0],[50,2,51,2],[50,3,51,3],[50,4,51,4],[50,5,51,5],[50,6,51,6],[46,0,49,0],[46,2,47,2],[46,3,47,3],[46,4,47,4],[46,5,47,5],[42,0,45,0],[42,1,43,1],[42,2,43,2],[42,3,43,3],[42,4,43,4],[42,5,43,5],[42,6,43,6],[36,2,37,2],[36,3,37,3],[36,5,37,5],[36,6,37,6],[38,0,41,0],[38,2,39,2],[38,3,39,3],[38,4,39,4],[38,5,39,5],[38,6,39,6],[34,0,37,0],[34,2,35,2],[34,3,35,3],[34,5,35,5],[34,6,35,6],[34,1,35,1],[36,1,37,1],[42,14,45,18],[44,1,45,1],[44,2,45,2],[44,3,45,3],[44,4,45,4],[44,5,45,5],[44,6,45,6],[44,9,45,9],[44,11,45,11],[43,12,44,12],[58,13,61,13],[58,14,61,18],[60,1,61,1],[60,2,61,2],[60,3,61,3],[60,4,61,4],[60,5,61,5],[60,6,61,6],[60,9,61,9],[60,11,61,11],[11,12,12,12],[15,12,16,12],[19,12,20,12],[23,12,24,12],[27,12,28,12],[31,12,32,12],[35,12,36,12],[39,12,40,12],[58,9,59,9],[58,10,61,10],[50,9,51,9],[50,10,53,10],[38,10,41,10],[47,12,48,12],[51,12,52,12],[55,12,56,12],[59,12,60,12],[123,12,124,12],[87,12,88,12],[91,12,92,12],[95,12,96,12],[99,12,100,12],[103,12,104,12],[107,12,108,12],[111,12,112,12],[115,12,116,12],[119,12,120,12]]}
["STREAM IMPACT CALCULATOR"]
[]
["BACKGROUND INFORMATION ",null,null,null,null,null,null,null,null,null,null,"TOTAL STREAM LOSSES (Functional Feet)",null,null,{"$f":"SUM(N11:N126)","v":-909.88736354577441}]
["Corps Project ID #:",null,"NAB-2023-85656",null,null,"Corps PM:",null,"James Brown"]
["Project Name:",null,"Acme Airport Runway",null,null,"Date:",null,"2023-02-27"]
["Lat/Long:",null,"36.78954, -76.55444",null,null,"Sponsor:",null,"Acme Airports"]
["County:",null,"Baltimore ",null,null,"Collaborators: ",null,"GKH, JMB, CTT"]
["Raw Change in Reach Value (Functional Feet) ",null,null,null,null,null,null,null,null,null,null,"Stream Impact Adjustments",null,"Stream Losses (Functional Feet)","REMARKS            (Include reach coordinates)"]
["Reach Name","Physiographic Region","Evaluation","Activity","Resource Type","Reach Length (feet)","Stream Quality","Channel Thread","Drainage Area (sqmi)","Raw Reach Value (Functional Feet)","Raw Change in Value (Functional Feet)","Site Sensitivity","Mitigation Ratio"]
[]
["example 1","Piedmont","Existing","Preliminary Resource Evaluation","Intermittent",1270,0.43,"Primary",0.5,{"$f":"IF(H11=\"Second\",(F11*G11*H12*1),IF(H11=\"Third\",(F11*G11*H12*1),(F11*G11*H12*I12)))","v":416.74507700668067},{"$f":"(J13-J11)","v":-416.74507700668067},1,"Proposed Mitigation Type",{"$f":"(K11+L13)*M14","v":-687.62937706102309},"36.78954, -76.55441. Fill of channel to create airport runway.  "]
[null,null,null,null,null,null,null,{"$f":"IF(H11=\"Primary\",1,IF(H11=\"Second\",0.2,IF(H11=\"Third\",0.1,IF(H11=\"\",0))))","v":1},{"$f":"IF(AND(B11=\"Piedmont\",I11>0.0001,I11<0.1),0.41, IF(AND(B11=\"Piedmont\",I11>10), 2.45, IF(B11=\"Piedmont\",I11^0.39, IF(AND(B11=\"Coastal Plain\",I11>0.0001,I11<0.1),0.42,IF(AND(B11=\"Coastal Plain\",I11>10),2.4, IF(B11=\"Coastal Plain\",I11^0.38, IF(AND(B11=\"Mountain\",I11>0.0001,I11<0.1),0.36,IF(AND(B11=\"Mountain\",I11>10),2.75,IF(B11=\"Mountain\",I11^0.44)))))))))","v":0.76312960448027956},null,null,{"$f":"IF(L11=\"Select\", 0,L11*0.1)","v":0.1},"Permittee Responsible"]
[null,{"$f":"B11","v":"Piedmont"},"Proposed","Fill","Intermittent",0,0,{"$f":"H11","v":"Primary"},{"$f":"I11","v":0.5},{"$f":"IF(H13=\"Second\",(F13*G13*H14*1),IF(H13=\"Third\",(F13*G13*H14*1),(F13*G13*H14*I14)))","v":0},null,{"$f":"K11*L12","v":-41.674507700668073}]
[null,null,null,null,null,null,null,{"$f":"IF(H13=\"Primary\",1,IF(H13=\"Second\",0.2,IF(H13=\"Third\",0.1,0)))","v":1},{"$f":"IF(AND(B13=\"Piedmont\",I13>0.0001,I13<0.1),0.41, IF(AND(B13=\"Piedmont\",I13>10), 2.45, IF(B13=\"Piedmont\",I13^0.39, IF(AND(B13=\"Coastal Plain\",I13>0.0001,I13<0.1),0.42,IF(AND(B13=\"Coastal Plain\",I13>10),2.4, IF(B13=\"Coastal Plain\",I13^0.38, IF(AND(B13=\"Mountain\",I13>0.0001,I13<0.1),0.36,IF(AND(B13=\"Mountain\",I13>10),2.75,IF(B13=\"Mountain\",I13^0.44)))))))))","v":0.76312960448027956},null,null,null,{"$f":"IF(M12=\"Mitigation Bank\",1.3,IF(M12=\"PRM Advanced Mitigation\",1.3,IF(M12=\"In Lieu Fee Released\",1.3, 1.5)))","v":1.5}]
["example 2","Piedmont","Existing","Preliminary Resource Evaluation","Perennial Headwater",500,0.53,"Primary",1.5,{"$f":"IF(H15=\"Second\",(F15*G15*H16*1),IF(H15=\"Third\",(F15*G15*H16*1),(F15*G15*H16*I16)))","v":310.39982302218237},{"$f":"(J17-J15)","v":-134.70180999075839},1,"Proposed Mitigation Type",{"$f":"(K15+L17)*M18","v":-222.25798648475134},"36.78955, -76.55452. Channel armoring below bridge.  "]
[null,null,null,null,null,null,null,{"$f":"IF(H15=\"Primary\",1,IF(H15=\"Second\",0.2,IF(H15=\"Third\",0.1,IF(H15=\"\",0))))","v":1},{"$f":"IF(AND(B15=\"Piedmont\",I15>0.0001,I15<0.1),0.41, IF(AND(B15=\"Piedmont\",I15>10), 2.45, IF(B15=\"Piedmont\",I15^0.39, IF(AND(B15=\"Coastal Plain\",I15>0.0001,I15<0.1),0.42,IF(AND(B15=\"Coastal Plain\",I15>10),2.4, IF(B15=\"Coastal Plain\",I15^0.38, IF(AND(B15=\"Mountain\",I15>0.0001,I15<0.1),0.36,IF(AND(B15=\"Mountain\",I15>10),2.75,IF(B15=\"Mountain\",I15^0.44)))))))))","v":1.17132008687616},null,null,{"$f":"IF(L15=\"Select\", 0,L15*0.1)","v":0.1},"Permittee Responsible"]
[null,{"$f":"B15","v":"Piedmont"},"Proposed","Channel Hardening","Perennial Headwater",500,0.3,{"$f":"H15","v":"Primary"},{"$f":"I15","v":1.5},{"$f":"IF(H17=\"Second\",(F17*G17*H18*1),IF(H17=\"Third\",(F17*G17*H18*1),(F17*G17*H18*I18)))","v":175.69801303142398},null,{"$f":"K15*L16","v":-13.47018099907584}]
[null,null,null,null,null,null,null,{"$f":"IF(H17=\"Primary\",1,IF(H17=\"Second\",0.2,IF(H17=\"Third\",0.1,0)))","v":1},{"$f":"IF(AND(B17=\"Piedmont\",I17>0.0001,I17<0.1),0.41, IF(AND(B17=\"Piedmont\",I17>10), 2.45, IF(B17=\"Piedmont\",I17^0.39, IF(AND(B17=\"Coastal Plain\",I17>0.0001,I17<0.1),0.42,IF(AND(B17=\"Coastal Plain\",I17>10),2.4, IF(B17=\"Coastal Plain\",I17^0.38, IF(AND(B17=\"Mountain\",I17>0.0001,I17<0.1),0.36,IF(AND(B17=\"Mountain\",I17>10),2.75,IF(B17=\"Mountain\",I17^0.44)))))))))","v":1.17132008687616},null,null,null,{"$f":"IF(M16=\"Mitigation Bank\",1.3,IF(M16=\"PRM Advanced Mitigation\",1.3,IF(M16=\"In Lieu Fee Released\",1.3, 1.5)))","v":1.5}]
[null,"Not Selected","Existing","Preliminary Resource Evaluation","Select From Dropdown",0,null,"Select",null,{"$f":"IF(H19=\"Second\",(F19*G19*H20*1),IF(H19=\"Third\",(F19*G19*H20*1),(F19*G19*H20*I20)))","v":0},{"$f":"(J21-J19)","v":0},"Select","Proposed Mitigation Type",{"$f":"(K19+L21)*M22","v":0}]
[null,null,null,null,null,null,null,{"$f":"IF(H19=\"Primary\",1,IF(H19=\"Second\",0.2,IF(H19=\"Third\",0.1,IF(H19=\"\",0))))","v":false},{"$f":"IF(AND(B19=\"Piedmont\",I19>0.0001,I19<0.1),0.41, IF(AND(B19=\"Piedmont\",I19>10), 2.45, IF(B19=\"Piedmont\",I19^0.39, IF(AND(B19=\"Coastal Plain\",I19>0.0001,I19<0.1),0.42,IF(AND(B19=\"Coastal Plain\",I19>10),2.4, IF(B19=\"Coastal Plain\",I19^0.38, IF(AND(B19=\"Mountain\",I19>0.0001,I19<0.1),0.36,IF(AND(B19=\"Mountain\",I19>10),2.75,IF(B19=\"Mountain\",I19^0.44)))))))))","v":false},null,null,{"$f":"IF(L19=\"Select\", 0,L19*0.1)","v":0},"Select from Dropdown"]
[null,{"$f":"B19","v":"Not Selected"},"Proposed","Not Selected","Select from Dropdown",0,null,{"$f":"H19","v":"Select"},{"$f":"I19","v":0},{"$f":"IF(H21=\"Second\",(F21*G21*H22*1),IF(H21=\"Third\",(F21*G21*H22*1),(F21*G21*H22*I22)))","v":0},null,{"$f":"K19*L20","v":0}]
[null,null,null,null,null,null,null,{"$f":"IF(H21=\"Primary\",1,IF(H21=\"Second\",0.2,IF(H21=\"Third\",0.1,0)))","v":0},{"$f":"IF(AND(B21=\"Piedmont\",I21>0.0001,I21<0.1),0.41, IF(AND(B21=\"Piedmont\",I21>10), 2.45, IF(B21=\"Piedmont\",I21^0.39, IF(AND(B21=\"Coastal Plain\",I21>0.0001,I21<0.1),0.42,IF(AND(B21=\"Coastal Plain\",I21>10),2.4, IF(B21=\"Coastal Plain\",I21^0.38, IF(AND(B21=\"Mountain\",I21>0.0001,I21<0.1),0.36,IF(AND(B21=\"Mountain\",I21>10),2.75,IF(B21=\"Mountain\",I21^0.44)))))))))","v":false},null,null,null,{"$f":"IF(M20=\"Mitigation Bank\",1.3,IF(M20=\"PRM Advanced Mitigation\",1.3,IF(M20=\"In Lieu Fee Released\",1.3, 1.5)))","v":1.5}]
[null,"Not Selected","Existing","Preliminary Resource Evaluation","Select From Dropdown",0,null,"Select",null,{"$f":"IF(H23=\"Second\",(F23*G23*H24*1),IF(H23=\"Third\",(F23*G23*H24*1),(F23*G23*H24*I24)))","v":0},{"$f":"(J25-J23)","v":0},"Select","Proposed Mitigation Type",{"$f":"(K23+L25)*M26","v":0}]
[null,null,null,null,null,null,null,{"$f":"IF(H23=\"Primary\",1,IF(H23=\"Second\",0.2,IF(H23=\"Third\",0.1,IF(H23=\"\",0))))","v":false},{"$f":"IF(AND(B23=\"Piedmont\",I23>0.0001,I23<0.1),0.41, IF(AND(B23=\"Piedmont\",I23>10), 2.45, IF(B23=\"Piedmont\",I23^0.39, IF(AND(B23=\"Coastal Plain\",I23>0.0001,I23<0.1),0.42,IF(AND(B23=\"Coastal Plain\",I23>10),2.4, IF(B23=\"Coastal Plain\",I23^0.38, IF(AND(B23=\"Mountain\",I23>0.0001,I23<0.1),0.36,IF(AND(B23=\"Mountain\",I23>10),2.75,IF(B23=\"Mountain\",I23^0.44)))))))))","v":false},null,null,{"$f":"IF(L23=\"Select\", 0,L23*0.1)","v":0},"Select from Dropdown"]
[null,{"$f":"B23","v":"Not Selected"},"Proposed","Not Selected","Select from Dropdown",0,null,{"$f":"H23","v":"Select"},{"$f":"I23","v":0},{"$f":"IF(H25=\"Second\",(F25*G25*H26*1),IF(H25=\"Third\",(F25*G25*H26*1),(F25*G25*H26*I26)))","v":0},null,{"$f":"K23*L24","v":0}]
[null,null,null,null,null,null,null,{"$f":"IF(H25=\"Primary\",1,IF(H25=\"Second\",0.2,IF(H25=\"Third\",0.1,0)))","v":0},{"$f":"IF(AND(B25=\"Piedmont\",I25>0.0001,I25<0.1),0.41, IF(AND(B25=\"Piedmont\",I25>10), 2.45, IF(B25=\"Piedmont\",I25^0.39, IF(AND(B25=\"Coastal Plain\",I25>0.0001,I25<0.1),0.42,IF(AND(B25=\"Coastal Plain\",I25>10),2.4, IF(B25=\"Coastal Plain\",I25^0.38, IF(AND(B25=\"Mountain\",I25>0.0001,I25<0.1),0.36,IF(AND(B25=\"Mountain\",I25>10),2.75,IF(B25=\"Mountain\",I25^0.44)))))))))","v":false},null,null,null,{"$f":"IF(M24=\"Mitigation Bank\",1.3,IF(M24=\"PRM Advanced Mitigation\",1.3,IF(M24=\"In Lieu Fee Released\",1.3, 1.5)))","v":1.5}]
[null,"Not Selected","Existing","Preliminary Resource Evaluation","Select From Dropdown",0,null,"Select",null,{"$f":"IF(H27=\"Second\",(F27*G27*H28*1),IF(H27=\"Third\",(F27*G27*H28*1),(F27*G27*H28*I28)))","v":0},{"$f":"(J29-J27)","v":0},"Select","Proposed Mitigation Type",{"$f":"(K27+L29)*M30","v":0}]
[null,null,null,null,null,null,null,{"$f":"IF(H27=\"Primary\",1,IF(H27=\"Second\",0.2,IF(H27=\"Third\",0.1,IF(H27=\"\",0))))","v":false},{"$f":"IF(AND(B27=\"Piedmont\",I27>0.0001,I27<0.1),0.41, IF(AND(B27=\"Piedmont\",I27>10), 2.45, IF(B27=\"Piedmont\",I27^0.39, IF(AND(B27=\"Coastal Plain\",I27>0.0001,I27<0.1),0.42,IF(AND(B27=\"Coastal Plain\",I27>10),2.4, IF(B27=\"Coastal Plain\",I27^0.38, IF(AND(B27=\"Mountain\",I27>0.0001,I27<0.1),0.36,IF(AND(B27=\"Mountain\",I27>10),2.75,IF(B27=\"Mountain\",I27^0.44)))))))))","v":false},null,null,{"$f":"IF(L27=\"Select\", 0,L27*0.1)","v":0},"Select from Dropdown"]
[null,{"$f":"B27","v":"Not Selected"},"Proposed","Not Selected","Select from Dropdown",0,null,{"$f":"H27","v":"Select"},{"$f":"I27","v":0},{"$f":"IF(H29=\"Second\",(F29*G29*H30*1),IF(H29=\"Third\",(F29*G29*H30*1),(F29*G29*H30*I30)))","v":0},null,{"$f":"K27*L28","v":0}]
[null,null,null,null,null,null,null,{"$f":"IF(H29=\"Primary\",1,IF(H29=\"Second\",0.2,IF(H29=\"Third\",0.1,0)))","v":0},{"$f":"IF(AND(B29=\"Piedmont\",I29>0.0001,I29<0.1),0.41, IF(AND(B29=\"Piedmont\",I29>10), 2.45, IF(B29=\"Piedmont\",I29^0.39, IF(AND(B29=\"Coastal Plain\",I29>0.0001,I29<0.1),0.42,IF(AND(B29=\"Coastal Plain\",I29>10),2.4, IF(B29=\"Coastal Plain\",I29^0.38, IF(AND(B29=\"Mountain\",I29>0.0001,I29<0.1),0.36,IF(AND(B29=\"Mountain\",I29>10),2.75,IF(B29=\"Mountain\",I29^0.44)))))))))","v":false},null,null,null,{"$f":"IF(M28=\"Mitigation Bank\",1.3,IF(M28=\"PRM Advanced Mitigation\",1.3,IF(M28=\"In Lieu Fee Released\",1.3, 1.5)))","v":1.5}]
[null,"Not Selected","Existing","Preliminary Resource Evaluation","Select From Dropdown",0,null,"Select",null,{"$f":"IF(H31=\"Second\",(F31*G31*H32*1),IF(H31=\"Third\",(F31*G31*H32*1),(F31*G31*H32*I32)))","v":0},{"$f":"(J33-J31)","v":0},"Select","Proposed Mitigation Type",{"$f":"(K31+L33)*M34","v":0}]
[null,null,null,null,null,null,null,{"$f":"IF(H31=\"Primary\",1,IF(H31=\"Second\",0.2,IF(H31=\"Third\",0.1,IF(H31=\"\",0))))","v":false},{"$f":"IF(AND(B31=\"Piedmont\",I31>0.0001,I31<0.1),0.41, IF(AND(B31=\"Piedmont\",I31>10), 2.45, IF(B31=\"Piedmont\",I31^0.39, IF(AND(B31=\"Coastal Plain\",I31>0.0001,I31<0.1),0.42,IF(AND(B31=\"Coastal Plain\",I31>10),2.4, IF(B31=\"Coastal Plain\",I31^0.38, IF(AND(B31=\"Mountain\",I31>0.0001,I31<0.1),0.36,IF(AND(B31=\"Mountain\",I31>10),2.75,IF(B31=\"Mountain\",I31^0.44)))))))))","v":false},null,null,{"$f":"IF(L31=\"Select\", 0,L31*0.1)","v":0},"Select from Dropdown"]
[null,{"$f":"B31","v":"Not Selected"},"Proposed","Not Selected","Select from Dropdown",0,null,{"$f":"H31","v":"Select"},{"$f":"I31","v":0},{"$f":"IF(H33=\"Second\",(F33*G33*H34*1),IF(H33=\"Third\",(F33*G33*H34*1),(F33*G33*H34*I34)))","v":0},null,{"$f":"K31*L32","v":0}]
[null,null,null,null,null,null,null,{"$f":"IF(H33=\"Primary\",1,IF(H33=\"Second\",0.2,IF(H33=\"Third\",0.1,0)))","v":0},{"$f":"IF(AND(B33=\"Piedmont\",I33>0.0001,I33<0.1),0.41, IF(AND(B33=\"Piedmont\",I33>10), 2.45, IF(B33=\"Piedmont\",I33^0.39, IF(AND(B33=\"Coastal Plain\",I33>0.0001,I33<0.1),0.42,IF(AND(B33=\"Coastal Plain\",I33>10),2.4, IF(B33=\"Coastal Plain\",I33^0.38, IF(AND(B33=\"Mountain\",I33>0.0001,I33<0.1),0.36,IF(AND(B33=\"Mountain\",I33>10),2.75,IF(B33=\"Mountain\",I33^0.44)))))))))","v":false},null,null,null,{"$f":"IF(M32=\"Mitigation Bank\",1.3,IF(M32=\"PRM Advanced Mitigation\",1.3,IF(M32=\"In Lieu Fee Released\",1.3, 1.5)))","v":1.5}]
[null,"Not Selected","Existing","Preliminary Resource Evaluation","Select From Dropdown",0,null,"Select",null,{"$f":"IF(H35=\"Second\",(F35*G35*H36*1),IF(H35=\"Third\",(F35*G35*H36*1),(F35*G35*H36*I36)))","v":0},{"$f":"(J37-J35)","v":0},"Select","Proposed Mitigation Type",{"$f":"(K35+L37)*M38","v":0}]
[null,null,null,null,null,null,null,{"$f":"IF(H35=\"Primary\",1,IF(H35=\"Second\",0.2,IF(H35=\"Third\",0.1,IF(H35=\"\",0))))","v":false},{"$f":"IF(AND(B35=\"Piedmont\",I35>0.0001,I35<0.1),0.41, IF(AND(B35=\"Piedmont\",I35>10), 2.45, IF(B35=\"Piedmont\",I35^0.39, IF(AND(B35=\"Coastal Plain\",I35>0.0001,I35<0.1),0.42,IF(AND(B35=\"Coastal Plain\",I35>10),2.4, IF(B35=\"Coastal Plain\",I35^0.38, IF(AND(B35=\"Mountain\",I35>0.0001,I35<0.1),0.36,IF(AND(B35=\"Mountain\",I35>10),2.75,IF(B35=\"Mountain\",I35^0.44)))))))))","v":false},null,null,{"$f":"IF(L35=\"Select\", 0,L35*0.1)","v":0},"Select from Dropdown"]
[null,{"$f":"B35","v":"Not Selected"},"Proposed","Not Selected","Select from Dropdown",0,null,{"$f":"H35","v":"Select"},{"$f":"I35","v":0},{"$f":"IF(H37=\"Second\",(F37*G37*H38*1),IF(H37=\"Third\",(F37*G37*H38*1),(F37*G37*H38*I38)))","v":0},null,{"$f":"K35*L36","v":0}]
[null,null,null,null,null,null,null,{"$f":"IF(H37=\"Primary\",1,IF(H37=\"Second\",0.2,IF(H37=\"Third\",0.1,0)))","v":0},{"$f":"IF(AND(B37=\"Piedmont\",I37>0.0001,I37<0.1),0.41, IF(AND(B37=\"Piedmont\",I37>10), 2.45, IF(B37=\"Piedmont\",I37^0.39, IF(AND(B37=\"Coastal Plain\",I37>0.0001,I37<0.1),0.42,IF(AND(B37=\"Coastal Plain\",I37>10),2.4, IF(B37=\"Coastal Plain\",I37^0.38, IF(AND(B37=\"Mountain\",I37>0.0001,I37<0.1),0.36,IF(AND(B37=\"Mountain\",I37>10),2.75,IF(B37=\"Mountain\",I37^0.44)))))))))","v":false},null,null,null,{"$f":"IF(M36=\"Mitigation Bank\",1.3,IF(M36=\"PRM Advanced Mitigation\",1.3,IF(M36=\"In Lieu Fee Released\",1.3, 1.5)))","v":1.5}]
[null,"Not Selected","Existing","Preliminary Resource Evaluation","Select From Dropdown",0,null,"Select",null,{"$f":"IF(H39=\"Second\",(F39*G39*H40*1),IF(H39=\"Third\",(F39*G39*H40*1),(F39*G39*H40*I40)))","v":0},{"$f":"(J41-J39)","v":0},"Select","Proposed Mitigation Type",{"$f":"(K39+L41)*M42","v":0}]
[null,null,null,null,null,null,null,{"$f":"IF(H39=\"Primary\",1,IF(H39=\"Second\",0.2,IF(H39=\"Third\",0.1,IF(H39=\"\",0))))","v":false},{"$f":"IF(AND(B39=\"Piedmont\",I39>0.0001,I39<0.1),0.41, IF(AND(B39=\"Piedmont\",I39>10), 2.45, IF(B39=\"Piedmont\",I39^0.39, IF(AND(B39=\"Coastal Plain\",I39>0.0001,I39<0.1),0.42,IF(AND(B39=\"Coastal Plain\",I39>10),2.4, IF(B39=\"Coastal Plain\",I39^0.38, IF(AND(B39=\"Mountain\",I39>0.0001,I39<0.1),0.36,IF(AND(B39=\"Mountain\",I39>10),2.75,IF(B39=\"Mountain\",I39^0.44)))))))))","v":false},null,null,{"$f":"IF(L39=\"Select\", 0,L39*0.1)","v":0},"Select from Dropdown"]
[null,{"$f":"B39","v":"Not Selected"},"Proposed","Not Selected","Select from Dropdown",0,null,{"$f":"H39","v":"Select"},{"$f":"I39","v":0},{"$f":"IF(H41=\"Second\",(F41*G41*H42*1),IF(H41=\"Third\",(F41*G41*H42*1),(F41*G41*H42*I42)))","v":0},null,{"$f":"K39*L40","v":0}]
[null,null,null,null,null,null,null,{"$f":"IF(H41=\"Primary\",1,IF(H41=\"Second\",0.2,IF(H41=\"Third\",0.1,0)))","v":0},{"$f":"IF(AND(B41=\"Piedmont\",I41>0.0001,I41<0.1),0.41, IF(AND(B41=\"Piedmont\",I41>10), 2.45, IF(B41=\"Piedmont\",I41^0.39, IF(AND(B41=\"Coastal Plain\",I41>0.0001,I41<0.1),0.42,IF(AND(B41=\"Coastal Plain\",I41>10),2.4, IF(B41=\"Coastal Plain\",I41^0.38, IF(AND(B41=\"Mountain\",I41>0.0001,I41<0.1),0.36,IF(AND(B41=\"Mountain\",I41>10),2.75,IF(B41=\"Mountain\",I41^0.44)))))))))","v":false},null,null,null,{"$f":"IF(M40=\"Mitigation Bank\",1.3,IF(M40=\"PRM Advanced Mitigation\",1.3,IF(M40=\"In Lieu Fee Released\",1.3, 1.5)))","v":1.5}]
[null,"Not Selected","Existing","Preliminary Resource Evaluation","Select From Dropdown",0,null,"Select",null,{"$f":"IF(H43=\"Second\",(F43*G43*H44*1),IF(H43=\"Third\",(F43*G43*H44*1),(F43*G43*H44*I44)))","v":0},{"$f":"(J45-J43)","v":0},"Select","Proposed Mitigation Type",{"$f":"(K43+L45)*M46","v":0}]
[null,null,null,null,null,null,null,{"$f":"IF(H43=\"Primary\",1,IF(H43=\"Second\",0.2,IF(H43=\"Third\",0.1,IF(H43=\"\",0))))","v":false},{"$f":"IF(AND(B43=\"Piedmont\",I43>0.0001,I43<0.1),0.41, IF(AND(B43=\"Piedmont\",I43>10), 2.45, IF(B43=\"Piedmont\",I43^0.39, IF(AND(B43=\"Coastal Plain\",I43>0.0001,I43<0.1),0.42,IF(AND(B43=\"Coastal Plain\",I43>10),2.4, IF(B43=\"Coastal Plain\",I43^0.38, IF(AND(B43=\"Mountain\",I43>0.0001,I43<0.1),0.36,IF(AND(B43=\"Mountain\",I43>10),2.75,IF(B43=\"Mountain\",I43^0.44)))))))))","v":false},null,null,{"$f":"IF(L43=\"Select\", 0,L43*0.1)","v":0},"Select from Dropdown"]
[null,{"$f":"B43","v":"Not Selected"},"Proposed","Not Selected","Select from Dropdown",0,null,{"$f":"H43","v":"Select"},{"$f":"I43","v":0},{"$f":"IF(H45=\"Second\",(F45*G45*H46*1),IF(H45=\"Third\",(F45*G45*H46*1),(F45*G45*H46*I46)))","v":0},null,{"$f":"K43*L44","v":0}]
[null,null,null,null,null,null,null,{"$f":"IF(H45=\"Primary\",1,IF(H45=\"Second\",0.2,IF(H45=\"Third\",0.1,0)))","v":0},{"$f":"IF(AND(B45=\"Piedmont\",I45>0.0001,I45<0.1),0.41, IF(AND(B45=\"Piedmont\",I45>10), 2.45, IF(B45=\"Piedmont\",I45^0.39, IF(AND(B45=\"Coastal Plain\",I45>0.0001,I45<0.1),0.42,IF(AND(B45=\"Coastal Plain\",I45>10),2.4, IF(B45=\"Coastal Plain\",I45^0.38, IF(AND(B45=\"Mountain\",I45>0.0001,I45<0.1),0.36,IF(AND(B45=\"Mountain\",I45>10),2.75,IF(B45=\"Mountain\",I45^0.44)))))))))","v":false},null,null,null,{"$f":"IF(M44=\"Mitigation Bank\",1.3,IF(M44=\"PRM Advanced Mitigation\",1.3,IF(M44=\"In Lieu Fee Released\",1.3, 1.5)))","v":1.5}]
[null,"Not Selected","Existing","Preliminary Resource Evaluation","Select From Dropdown",0,null,"Select",null,{"$f":"IF(H47=\"Second\",(F47*G47*H48*1),IF(H47=\"Third\",(F47*G47*H48*1),(F47*G47*H48*I48)))","v":0},{"$f":"(J49-J47)","v":0},"Select","Proposed Mitigation Type",{"$f":"(K47+L49)*M50","v":0}]
[null,null,null,null,null,null,null,{"$f":"IF(H47=\"Primary\",1,IF(H47=\"Second\",0.2,IF(H47=\"Third\",0.1,IF(H47=\"\",0))))","v":false},{"$f":"IF(AND(B47=\"Piedmont\",I47>0.0001,I47<0.1),0.41, IF(AND(B47=\"Piedmont\",I47>10), 2.45, IF(B47=\"Piedmont\",I47^0.39, IF(AND(B47=\"Coastal Plain\",I47>0.0001,I47<0.1),0.42,IF(AND(B47=\"Coastal Plain\",I47>10),2.4, IF(B47=\"Coastal Plain\",I47^0.38, IF(AND(B47=\"Mountain\",I47>0.0001,I47<0.1),0.36,IF(AND(B47=\"Mountain\",I47>10),2.75,IF(B47=\"Mountain\",I47^0.44)))))))))","v":false},null,null,{"$f":"IF(L47=\"Select\", 0,L47*0.1)","v":0},"Select from Dropdown"]
[null,{"$f":"B47","v":"Not Selected"},"Proposed","Not Selected","Select from Dropdown",0,null,{"$f":"H47","v":"Select"},{"$f":"I47","v":0},{"$f":"IF(H49=\"Second\",(F49*G49*H50*1),IF(H49=\"Third\",(F49*G49*H50*1),(F49*G49*H50*I50)))","v":0},null,{"$f":"K47*L48","v":0}]
[null,null,null,null,null,null,null,{"$f":"IF(H49=\"Primary\",1,IF(H49=\"Second\",0.2,IF(H49=\"Third\",0.1,0)))","v":0},{"$f":"IF(AND(B49=\"Piedmont\",I49>0.0001,I49<0.1),0.41, IF(AND(B49=\"Piedmont\",I49>10), 2.45, IF(B49=\"Piedmont\",I49^0.39, IF(AND(B49=\"Coastal Plain\",I49>0.0001,I49<0.1),0.42,IF(AND(B49=\"Coastal Plain\",I49>10),2.4, IF(B49=\"Coastal Plain\",I49^0.38, IF(AND(B49=\"Mountain\",I49>0.0001,I49<0.1),0.36,IF(AND(B49=\"Mountain\",I49>10),2.75,IF(B49=\"Mountain\",I49^0.44)))))))))","v":false},null,null,null,{"$f":"IF(M48=\"Mitigation Bank\",1.3,IF(M48=\"PRM Advanced Mitigation\",1.3,IF(M48=\"In Lieu Fee Released\",1.3, 1.5)))","v":1.5}]
[null,"Not Selected","Existing","Preliminary Resource Evaluation","Select From Dropdown",0,null,"Select",null,{"$f":"IF(H51=\"Second\",(F51*G51*H52*1),IF(H51=\"Third\",(F51*G51*H52*1),(F51*G51*H52*I52)))","v":0},{"$f":"(J53-J51)","v":0},"Select","Proposed Mitigation Type",{"$f":"(K51+L53)*M54","v":0}]
[null,null,null,null,null,null,null,{"$f":"IF(H51=\"Primary\",1,IF(H51=\"Second\",0.2,IF(H51=\"Third\",0.1,IF(H51=\"\",0))))","v":false},{"$f":"IF(AND(B51=\"Piedmont\",I51>0.0001,I51<0.1),0.41, IF(AND(B51=\"Piedmont\",I51>10), 2.45, IF(B51=\"Piedmont\",I51^0.39, IF(AND(B51=\"Coastal Plain\",I51>0.0001,I51<0.1),0.42,IF(AND(B51=\"Coastal Plain\",I51>10),2.4, IF(B51=\"Coastal Plain\",I51^0.38, IF(AND(B51=\"Mountain\",I51>0.0001,I51<0.1),0.36,IF(AND(B51=\"Mountain\",I51>10),2.75,IF(B51=\"Mountain\",I51^0.44)))))))))","v":false},null,null,{"$f":"IF(L51=\"Select\", 0,L51*0.1)","v":0},"Select from Dropdown"]
[null,{"$f":"B51","v":"Not Selected"},"Proposed","Not Selected","Select from Dropdown",0,null,{"$f":"H51","v":"Select"},{"$f":"I51","v":0},{"$f":"IF(H53=\"Second\",(F53*G53*H54*1),IF(H53=\"Third\",(F53*G53*H54*1),(F53*G53*H54*I54)))","v":0},null,{"$f":"K51*L52","v":0}]
[null,null,null,null,null,null,null,{"$f":"IF(H53=\"Primary\",1,IF(H53=\"Second\",0.2,IF(H53=\"Third\",0.1,0)))","v":0},{"$f":"IF(AND(B53=\"Piedmont\",I53>0.0001,I53<0.1),0.41, IF(AND(B53=\"Piedmont\",I53>10), 2.45, IF(B53=\"Piedmont\",I53^0.39, IF(AND(B53=\"Coastal Plain\",I53>0.0001,I53<0.1),0.42,IF(AND(B53=\"Coastal Plain\",I53>10),2.4, IF(B53=\"Coastal Plain\",I53^0.38, IF(AND(B53=\"Mountain\",I53>0.0001,I53<0.1),0.36,IF(AND(B53=\"Mountain\",I53>10),2.75,IF(B53=\"Mountain\",I53^0.44)))))))))","v":false},null,null,null,{"$f":"IF(M52=\"Mitigation Bank\",1.3,IF(M52=\"PRM Advanced Mitigation\",1.3,IF(M52=\"In Lieu Fee Released\",1.3, 1.5)))","v":1.5}]
[null,"Not Selected","Existing","Preliminary Resource Evaluation","Select From Dropdown",0,null,"Select",null,{"$f":"IF(H55=\"Second\",(F55*G55*H56*1),IF(H55=\"Third\",(F55*G55*H56*1),(F55*G55*H56*I56)))","v":0},{"$f":"(J57-J55)","v":0},"Select","Proposed Mitigation Type",{"$f":"(K55+L57)*M58","v":0}]
[null,null,null,null,null,null,null,{"$f":"IF(H55=\"Primary\",1,IF(H55=\"Second\",0.2,IF(H55=\"Third\",0.1,IF(H55=\"\",0))))","v":false},{"$f":"IF(AND(B55=\"Piedmont\",I55>0.0001,I55<0.1),0.41, IF(AND(B55=\"Piedmont\",I55>10), 2.45, IF(B55=\"Piedmont\",I55^0.39, IF(AND(B55=\"Coastal Plain\",I55>0.0001,I55<0.1),0.42,IF(AND(B55=\"Coastal Plain\",I55>10),2.4, IF(B55=\"Coastal Plain\",I55^0.38, IF(AND(B55=\"Mountain\",I55>0.0001,I55<0.1),0.36,IF(AND(B55=\"Mountain\",I55>10),2.75,IF(B55=\"Mountain\",I55^0.44)))))))))","v":false},null,null,{"$f":"IF(L55=\"Select\", 0,L55*0.1)","v":0},"Select from Dropdown"]
[null,{"$f":"B55","v":"Not Selected"},"Proposed","Not Selected","Select from Dropdown",0,null,{"$f":"H55","v":"Select"},{"$f":"I55","v":0},{"$f":"IF(H57=\"Second\",(F57*G57*H58*1),IF(H57=\"Third\",(F57*G57*H58*1),(F57*G57*H58*I58)))","v":0},null,{"$f":"K55*L56","v":0}]
[null,null,null,null,null,null,null,{"$f":"IF(H57=\"Primary\",1,IF(H57=\"Second\",0.2,IF(H57=\"Third\",0.1,0)))","v":0},{"$f":"IF(AND(B57=\"Piedmont\",I57>0.0001,I57<0.1),0.41, IF(AND(B57=\"Piedmont\",I57>10), 2.45, IF(B57=\"Piedmont\",I57^0.39, IF(AND(B57=\"Coastal Plain\",I57>0.0001,I57<0.1),0.42,IF(AND(B57=\"Coastal Plain\",I57>10),2.4, IF(B57=\"Coastal Plain\",I57^0.38, IF(AND(B57=\"Mountain\",I57>0.0001,I57<0.1),0.36,IF(AND(B57=\"Mountain\",I57>10),2.75,IF(B57=\"Mountain\",I57^0.44)))))))))","v":false},null,null,null,{"$f":"IF(M56=\"Mitigation Bank\",1.3,IF(M56=\"PRM Advanced Mitigation\",1.3,IF(M56=\"In Lieu Fee Released\",1.3, 1.5)))","v":1.5}]
[null,"Not Selected","Existing","Preliminary Resource Evaluation","Select From Dropdown",0,null,"Select",null,{"$f":"IF(H59=\"Second\",(F59*G59*H60*1),IF(H59=\"Third\",(F59*G59*H60*1),(F59*G59*H60*I60)))","v":0},{"$f":"(J61-J59)","v":0},"Select","Proposed Mitigation Type",{"$f":"(K59+L61)*M62","v":0}]
[null,null,null,null,null,null,null,{"$f":"IF(H59=\"Primary\",1,IF(H59=\"Second\",0.2,IF(H59=\"Third\",0.1,IF(H59=\"\",0))))","v":false},{"$f":"IF(AND(B59=\"Piedmont\",I59>0.0001,I59<0.1),0.41, IF(AND(B59=\"Piedmont\",I59>10), 2.45, IF(B59=\"Piedmont\",I59^0.39, IF(AND(B59=\"Coastal Plain\",I59>0.0001,I59<0.1),0.42,IF(AND(B59=\"Coastal Plain\",I59>10),2.4, IF(B59=\"Coastal Plain\",I59^0.38, IF(AND(B59=\"Mountain\",I59>0.0001,I59<0.1),0.36,IF(AND(B59=\"Mountain\",I59>10),2.75,IF(B59=\"Mountain\",I59^0.44)))))))))","v":false},null,null,{"$f":"IF(L59=\"Select\", 0,L59*0.1)","v":0},"Select from Dropdown"]
[null,{"$f":"B59","v":"Not Selected"},"Proposed","Not Selected","Select from Dropdown",0,null,{"$f":"H59","v":"Select"},{"$f":"I59","v":0},{"$f":"IF(H61=\"Second\",(F61*G61*H62*1),IF(H61=\"Third\",(F61*G61*H62*1),(F61*G61*H62*I62)))","v":0},null,{"$f":"K59*L60","v":0}]
[null,null,null,null,null,null,null,{"$f":"IF(H61=\"Primary\",1,IF(H61=\"Second\",0.2,IF(H61=\"Third\",0.1,0)))","v":0},{"$f":"IF(AND(B61=\"Piedmont\",I61>0.0001,I61<0.1),0.41, IF(AND(B61=\"Piedmont\",I61>10), 2.45, IF(B61=\"Piedmont\",I61^0.39, IF(AND(B61=\"Coastal Plain\",I61>0.0001,I61<0.1),0.42,IF(AND(B61=\"Coastal Plain\",I61>10),2.4, IF(B61=\"Coastal Plain\",I61^0.38, IF(AND(B61=\"Mountain\",I61>0.0001,I61<0.1),0.36,IF(AND(B61=\"Mountain\",I61>10),2.75,IF(B61=\"Mountain\",I61^0.44)))))))))","v":false},null,null,null,{"$f":"IF(M60=\"Mitigation Bank\",1.3,IF(M60=\"PRM Advanced Mitigation\",1.3,IF(M60=\"In Lieu Fee Released\",1.3, 1.5)))","v":1.5}]
[null,"Not Selected","Existing","Preliminary Resource Evaluation","Select From Dropdown",0,null,"Select",null,{"$f":"IF(H63=\"Second\",(F63*G63*H64*1),IF(H63=\"Third\",(F63*G63*H64*1),(F63*G63*H64*I64)))","v":0},{"$f":"(J65-J63)","v":0},"Select","Proposed Mitigation Type",{"$f":"(K63+L65)*M66","v":0}]
[null,null,null,null,null,null,null,{"$f":"IF(H63=\"Primary\",1,IF(H63=\"Second\",0.2,IF(H63=\"Third\",0.1,IF(H63=\"\",0))))","v":false},{"$f":"IF(AND(B63=\"Piedmont\",I63>0.0001,I63<0.1),0.41, IF(AND(B63=\"Piedmont\",I63>10), 2.45, IF(B63=\"Piedmont\",I63^0.39, IF(AND(B63=\"Coastal Plain\",I63>0.0001,I63<0.1),0.42,IF(AND(B63=\"Coastal Plain\",I63>10),2.4, IF(B63=\"Coastal Plain\",I63^0.38, IF(AND(B63=\"Mountain\",I63>0.0001,I63<0.1),0.36,IF(AND(B63=\"Mountain\",I63>10),2.75,IF(B63=\"Mountain\",I63^0.44)))))))))","v":false},null,null,{"$f":"IF(L63=\"Select\", 0,L63*0.1)","v":0},"Select from Dropdown"]
[null,{"$f":"B63","v":"Not Selected"},"Proposed","Not Selected","Select from Dropdown",0,null,{"$f":"H63","v":"Select"},{"$f":"I63","v":0},{"$f":"IF(H65=\"Second\",(F65*G65*H66*1),IF(H65=\"Third\",(F65*G65*H66*1),(F65*G65*H66*I66)))","v":0},null,{"$f":"K63*L64","v":0}]
[null,null,null,null,null,null,null,{"$f":"IF(H65=\"Primary\",1,IF(H65=\"Second\",0.2,IF(H65=\"Third\",0.1,0)))","v":0},{"$f":"IF(AND(B65=\"Piedmont\",I65>0.0001,I65<0.1),0.41, IF(AND(B65=\"Piedmont\",I65>10), 2.45, IF(B65=\"Piedmont\",I65^0.39, IF(AND(B65=\"Coastal Plain\",I65>0.0001,I65<0.1),0.42,IF(AND(B65=\"Coastal Plain\",I65>10),2.4, IF(B65=\"Coastal Plain\",I65^0.38, IF(AND(B65=\"Mountain\",I65>0.0001,I65<0.1),0.36,IF(AND(B65=\"Mountain\",I65>10),2.75,IF(B65=\"Mountain\",I65^0.44)))))))))","v":false},null,null,null,{"$f":"IF(M64=\"Mitigation Bank\",1.3,IF(M64=\"PRM Advanced Mitigation\",1.3,IF(M64=\"In Lieu Fee Released\",1.3, 1.5)))","v":1.5}]
[null,"Not Selected","Existing","Preliminary Resource Evaluation","Select From Dropdown",0,null,"Select",null,{"$f":"IF(H67=\"Second\",(F67*G67*H68*1),IF(H67=\"Third\",(F67*G67*H68*1),(F67*G67*H68*I68)))","v":0},{"$f":"(J69-J67)","v":0},"Select","Proposed Mitigation Type",{"$f":"(K67+L69)*M70","v":0}]
[null,null,null,null,null,null,null,{"$f":"IF(H67=\"Primary\",1,IF(H67=\"Second\",0.2,IF(H67=\"Third\",0.1,IF(H67=\"\",0))))","v":false},{"$f":"IF(AND(B67=\"Piedmont\",I67>0.0001,I67<0.1),0.41, IF(AND(B67=\"Piedmont\",I67>10), 2.45, IF(B67=\"Piedmont\",I67^0.39, IF(AND(B67=\"Coastal Plain\",I67>0.0001,I67<0.1),0.42,IF(AND(B67=\"Coastal Plain\",I67>10),2.4, IF(B67=\"Coastal Plain\",I67^0.38, IF(AND(B67=\"Mountain\",I67>0.0001,I67<0.1),0.36,IF(AND(B67=\"Mountain\",I67>10),2.75,IF(B67=\"Mountain\",I67^0.44)))))))))","v":false},null,null,{"$f":"IF(L67=\"Select\", 0,L67*0.1)","v":0},"Select from Dropdown"]
[null,{"$f":"B67","v":"Not Selected"},"Proposed","Not Selected","Select from Dropdown",0,null,{"$f":"H67","v":"Select"},{"$f":"I67","v":0},{"$f":"IF(H69=\"Second\",(F69*G69*H70*1),IF(H69=\"Third\",(F69*G69*H70*1),(F69*G69*H70*I70)))","v":0},null,{"$f":"K67*L68","v":0}]
[null,null,null,null,null,null,null,{"$f":"IF(H69=\"Primary\",1,IF(H69=\"Second\",0.2,IF(H69=\"Third\",0.1,0)))","v":0},{"$f":"IF(AND(B69=\"Piedmont\",I69>0.0001,I69<0.1),0.41, IF(AND(B69=\"Piedmont\",I69>10), 2.45, IF(B69=\"Piedmont\",I69^0.39, IF(AND(B69=\"Coastal Plain\",I69>0.0001,I69<0.1),0.42,IF(AND(B69=\"Coastal Plain\",I69>10),2.4, IF(B69=\"Coastal Plain\",I69^0.38, IF(AND(B69=\"Mountain\",I69>0.0001,I69<0.1),0.36,IF(AND(B69=\"Mountain\",I69>10),2.75,IF(B69=\"Mountain\",I69^0.44)))))))))","v":false},null,null,null,{"$f":"IF(M68=\"Mitigation Bank\",1.3,IF(M68=\"PRM Advanced Mitigation\",1.3,IF(M68=\"In Lieu Fee Released\",1.3, 1.5)))","v":1.5}]
[null,"Not Selected","Existing","Preliminary Resource Evaluation","Select From Dropdown",null,null,"Select",null,{"$f":"IF(H71=\"Second\",(F71*G71*H72*1),IF(H71=\"Third\",(F71*G71*H72*1),(F71*G71*H72*I72)))","v":0},{"$f":"(J73-J71)","v":0},"Select","Proposed Mitigation Type",{"$f":"(K71+L73)*M74","v":0}]
[null,null,null,null,null,null,null,{"$f":"IF(H71=\"Primary\",1,IF(H71=\"Second\",0.2,IF(H71=\"Third\",0.1,IF(H71=\"\",0))))","v":false},{"$f":"IF(AND(B71=\"Piedmont\",I71>0.0001,I71<0.1),0.41, IF(AND(B71=\"Piedmont\",I71>10), 2.45, IF(B71=\"Piedmont\",I71^0.39, IF(AND(B71=\"Coastal Plain\",I71>0.0001,I71<0.1),0.42,IF(AND(B71=\"Coastal Plain\",I71>10),2.4, IF(B71=\"Coastal Plain\",I71^0.38, IF(AND(B71=\"Mountain\",I71>0.0001,I71<0.1),0.36,IF(AND(B71=\"Mountain\",I71>10),2.75,IF(B71=\"Mountain\",I71^0.44)))))))))","v":false},null,null,{"$f":"IF(L71=\"Select\", 0,L71*0.1)","v":0},"Select from Dropdown"]
[null,{"$f":"B71","v":"Not Selected"},"Proposed","Not Selected","Select from Dropdown",0,null,{"$f":"H71","v":"Select"},{"$f":"I71","v":0},{"$f":"IF(H73=\"Second\",(F73*G73*H74*1),IF(H73=\"Third\",(F73*G73*H74*1),(F73*G73*H74*I74)))","v":0},null,{"$f":"K71*L72","v":0}]
[null,null,null,null,null,null,null,{"$f":"IF(H73=\"Primary\",1,IF(H73=\"Second\",0.2,IF(H73=\"Third\",0.1,0)))","v":0},{"$f":"IF(AND(B73=\"Piedmont\",I73>0.0001,I73<0.1),0.41, IF(AND(B73=\"Piedmont\",I73>10), 2.45, IF(B73=\"Piedmont\",I73^0.39, IF(AND(B73=\"Coastal Plain\",I73>0.0001,I73<0.1),0.42,IF(AND(B73=\"Coastal Plain\",I73>10),2.4, IF(B73=\"Coastal Plain\",I73^0.38, IF(AND(B73=\"Mountain\",I73>0.0001,I73<0.1),0.36,IF(AND(B73=\"Mountain\",I73>10),2.75,IF(B73=\"Mountain\",I73^0.44)))))))))","v":false},null,null,null,{"$f":"IF(M72=\"Mitigation Bank\",1.3,IF(M72=\"PRM Advanced Mitigation\",1.3,IF(M72=\"In Lieu Fee Released\",1.3, 1.5)))","v":1.5}]
[null,"Not Selected","Existing","Preliminary Resource Evaluation","Select From Dropdown",0,null,"Select",null,{"$f":"IF(H75=\"Second\",(F75*G75*H76*1),IF(H75=\"Third\",(F75*G75*H76*1),(F75*G75*H76*I76)))","v":0},{"$f":"(J77-J75)","v":0},"Select","Proposed Mitigation Type",{"$f":"(K75+L77)*M78","v":0}]
[null,null,null,null,null,null,null,{"$f":"IF(H75=\"Primary\",1,IF(H75=\"Second\",0.2,IF(H75=\"Third\",0.1,IF(H75=\"\",0))))","v":false},{"$f":"IF(AND(B75=\"Piedmont\",I75>0.0001,I75<0.1),0.41, IF(AND(B75=\"Piedmont\",I75>10), 2.45, IF(B75=\"Piedmont\",I75^0.39, IF(AND(B75=\"Coastal Plain\",I75>0.0001,I75<0.1),0.42,IF(AND(B75=\"Coastal Plain\",I75>10),2.4, IF(B75=\"Coastal Plain\",I75^0.38, IF(AND(B75=\"Mountain\",I75>0.0001,I75<0.1),0.36,IF(AND(B75=\"Mountain\",I75>10),2.75,IF(B75=\"Mountain\",I75^0.44)))))))))","v":false},null,null,{"$f":"IF(L75=\"Select\", 0,L75*0.1)","v":0},"Select from Dropdown"]
[null,{"$f":"B75","v":"Not Selected"},"Proposed","Not Selected","Select from Dropdown",0,null,{"$f":"H75","v":"Select"},{"$f":"I75","v":0},{"$f":"IF(H77=\"Second\",(F77*G77*H78*1),IF(H77=\"Third\",(F77*G77*H78*1),(F77*G77*H78*I78)))","v":0},null,{"$f":"K75*L76","v":0}]
[null,null,null,null,null,null,null,{"$f":"IF(H77=\"Primary\",1,IF(H77=\"Second\",0.2,IF(H77=\"Third\",0.1,0)))","v":0},{"$f":"IF(AND(B77=\"Piedmont\",I77>0.0001,I77<0.1),0.41, IF(AND(B77=\"Piedmont\",I77>10), 2.45, IF(B77=\"Piedmont\",I77^0.39, IF(AND(B77=\"Coastal Plain\",I77>0.0001,I77<0.1),0.42,IF(AND(B77=\"Coastal Plain\",I77>10),2.4, IF(B77=\"Coastal Plain\",I77^0.38, IF(AND(B77=\"Mountain\",I77>0.0001,I77<0.1),0.36,IF(AND(B77=\"Mountain\",I77>10),2.75,IF(B77=\"Mountain\",I77^0.44)))))))))","v":false},null,null,null,{"$f":"IF(M76=\"Mitigation Bank\",1.3,IF(M76=\"PRM Advanced Mitigation\",1.3,IF(M76=\"In Lieu Fee Released\",1.3, 1.5)))","v":1.5}]
[null,"Not Selected","Existing","Preliminary Resource Evaluation","Select From Dropdown",0,null,"Select",null,{"$f":"IF(H79=\"Second\",(F79*G79*H80*1),IF(H79=\"Third\",(F79*G79*H80*1),(F79*G79*H80*I80)))","v":0},{"$f":"(J81-J79)","v":0},"Select","Proposed Mitigation Type",{"$f":"(K79+L81)*M82","v":0}]
[null,null,null,null,null,null,null,{"$f":"IF(H79=\"Primary\",1,IF(H79=\"Second\",0.2,IF(H79=\"Third\",0.1,IF(H79=\"\",0))))","v":false},{"$f":"IF(AND(B79=\"Piedmont\",I79>0.0001,I79<0.1),0.41, IF(AND(B79=\"Piedmont\",I79>10), 2.45, IF(B79=\"Piedmont\",I79^0.39, IF(AND(B79=\"Coastal Plain\",I79>0.0001,I79<0.1),0.42,IF(AND(B79=\"Coastal Plain\",I79>10),2.4, IF(B79=\"Coastal Plain\",I79^0.38, IF(AND(B79=\"Mountain\",I79>0.0001,I79<0.1),0.36,IF(AND(B79=\"Mountain\",I79>10),2.75,IF(B79=\"Mountain\",I79^0.44)))))))))","v":false},null,null,{"$f":"IF(L79=\"Select\", 0,L79*0.1)","v":0},"Select from Dropdown"]
[null,{"$f":"B79","v":"Not Selected"},"Proposed","Not Selected","Select from Dropdown",0,null,{"$f":"H79","v":"Select"},{"$f":"I79","v":0},{"$f":"IF(H81=\"Second\",(F81*G81*H82*1),IF(H81=\"Third\",(F81*G81*H82*1),(F81*G81*H82*I82)))","v":0},null,{"$f":"K79*L80","v":0}]
[null,null,null,null,null,null,null,{"$f":"IF(H81=\"Primary\",1,IF(H81=\"Second\",0.2,IF(H81=\"Third\",0.1,0)))","v":0},{"$f":"IF(AND(B81=\"Piedmont\",I81>0.0001,I81<0.1),0.41, IF(AND(B81=\"Piedmont\",I81>10), 2.45, IF(B81=\"Piedmont\",I81^0.39, IF(AND(B81=\"Coastal Plain\",I81>0.0001,I81<0.1),0.42,IF(AND(B81=\"Coastal Plain\",I81>10),2.4, IF(B81=\"Coastal Plain\",I81^0.38, IF(AND(B81=\"Mountain\",I81>0.0001,I81<0.1),0.36,IF(AND(B81=\"Mountain\",I81>10),2.75,IF(B81=\"Mountain\",I81^0.44)))))))))","v":false},null,null,null,{"$f":"IF(M80=\"Mitigation Bank\",1.3,IF(M80=\"PRM Advanced Mitigation\",1.3,IF(M80=\"In Lieu Fee Released\",1.3, 1.5)))","v":1.5}]
[null,"Not Selected","Existing","Preliminary Resource Evaluation","Select From Dropdown",0,null,"Select",null,{"$f":"IF(H83=\"Second\",(F83*G83*H84*1),IF(H83=\"Third\",(F83*G83*H84*1),(F83*G83*H84*I84)))","v":0},{"$f":"(J85-J83)","v":0},"Select","Proposed Mitigation Type",{"$f":"(K83+L85)*M86","v":0}]
[null,null,null,null,null,null,null,{"$f":"IF(H83=\"Primary\",1,IF(H83=\"Second\",0.2,IF(H83=\"Third\",0.1,IF(H83=\"\",0))))","v":false},{"$f":"IF(AND(B83=\"Piedmont\",I83>0.0001,I83<0.1),0.41, IF(AND(B83=\"Piedmont\",I83>10), 2.45, IF(B83=\"Piedmont\",I83^0.39, IF(AND(B83=\"Coastal Plain\",I83>0.0001,I83<0.1),0.42,IF(AND(B83=\"Coastal Plain\",I83>10),2.4, IF(B83=\"Coastal Plain\",I83^0.38, IF(AND(B83=\"Mountain\",I83>0.0001,I83<0.1),0.36,IF(AND(B83=\"Mountain\",I83>10),2.75,IF(B83=\"Mountain\",I83^0.44)))))))))","v":false},null,null,{"$f":"IF(L83=\"Select\", 0,L83*0.1)","v":0},"Select from Dropdown"]
[null,{"$f":"B83","v":"Not Selected"},"Proposed","Not Selected","Select from Dropdown",0,null,{"$f":"H83","v":"Select"},{"$f":"I83","v":0},{"$f":"IF(H85=\"Second\",(F85*G85*H86*1),IF(H85=\"Third\",(F85*G85*H86*1),(F85*G85*H86*I86)))","v":0},null,{"$f":"K83*L84","v":0}]
[null,null,null,null,null,null,null,{"$f":"IF(H85=\"Primary\",1,IF(H85=\"Second\",0.2,IF(H85=\"Third\",0.1,0)))","v":0},{"$f":"IF(AND(B85=\"Piedmont\",I85>0.0001,I85<0.1),0.41, IF(AND(B85=\"Piedmont\",I85>10), 2.45, IF(B85=\"Piedmont\",I85^0.39, IF(AND(B85=\"Coastal Plain\",I85>0.0001,I85<0.1),0.42,IF(AND(B85=\"Coastal Plain\",I85>10),2.4, IF(B85=\"Coastal Plain\",I85^0.38, IF(AND(B85=\"Mountain\",I85>0.0001,I85<0.1),0.36,IF(AND(B85=\"Mountain\",I85>10),2.75,IF(B85=\"Mountain\",I85^0.44)))))))))","v":false},null,null,null,{"$f":"IF(M84=\"Mitigation Bank\",1.3,IF(M84=\"PRM Advanced Mitigation\",1.3,IF(M84=\"In Lieu Fee Released\",1.3, 1.5)))","v":1.5}]
[null,"Not Selected","Existing","Preliminary Resource Evaluation","Select From Dropdown",0,null,"Select",null,{"$f":"IF(H87=\"Second\",(F87*G87*H88*1),IF(H87=\"Third\",(F87*G87*H88*1),(F87*G87*H88*I88)))","v":0},{"$f":"(J89-J87)","v":0},"Select","Proposed Mitigation Type",{"$f":"(K87+L89)*M90","v":0}]
[null,null,null,null,null,null,null,{"$f":"IF(H87=\"Primary\",1,IF(H87=\"Second\",0.2,IF(H87=\"Third\",0.1,IF(H87=\"\",0))))","v":false},{"$f":"IF(AND(B87=\"Piedmont\",I87>0.0001,I87<0.1),0.41, IF(AND(B87=\"Piedmont\",I87>10), 2.45, IF(B87=\"Piedmont\",I87^0.39, IF(AND(B87=\"Coastal Plain\",I87>0.0001,I87<0.1),0.42,IF(AND(B87=\"Coastal Plain\",I87>10),2.4, IF(B87=\"Coastal Plain\",I87^0.38, IF(AND(B87=\"Mountain\",I87>0.0001,I87<0.1),0.36,IF(AND(B87=\"Mountain\",I87>10),2.75,IF(B87=\"Mountain\",I87^0.44)))))))))","v":false},null,null,{"$f":"IF(L87=\"Select\", 0,L87*0.1)","v":0},"Select from Dropdown"]
[null,{"$f":"B87","v":"Not Selected"},"Proposed","Not Selected","Select from Dropdown",0,null,{"$f":"H87","v":"Select"},{"$f":"I87","v":0},{"$f":"IF(H89=\"Second\",(F89*G89*H90*1),IF(H89=\"Third\",(F89*G89*H90*1),(F89*G89*H90*I90)))","v":0},null,{"$f":"K87*L88","v":0}]
[null,null,null,null,null,null,null,{"$f":"IF(H89=\"Primary\",1,IF(H89=\"Second\",0.2,IF(H89=\"Third\",0.1,0)))","v":0},{"$f":"IF(AND(B89=\"Piedmont\",I89>0.0001,I89<0.1),0.41, IF(AND(B89=\"Piedmont\",I89>10), 2.45, IF(B89=\"Piedmont\",I89^0.39, IF(AND(B89=\"Coastal Plain\",I89>0.0001,I89<0.1),0.42,IF(AND(B89=\"Coastal Plain\",I89>10),2.4, IF(B89=\"Coastal Plain\",I89^0.38, IF(AND(B89=\"Mountain\",I89>0.0001,I89<0.1),0.36,IF(AND(B89=\"Mountain\",I89>10),2.75,IF(B89=\"Mountain\",I89^0.44)))))))))","v":false},null,null,null,{"$f":"IF(M88=\"Mitigation Bank\",1.3,IF(M88=\"PRM Advanced Mitigation\",1.3,IF(M88=\"In Lieu Fee Released\",1.3, 1.5)))","v":1.5}]
[null,"Not Selected","Existing","Preliminary Resource Evaluation","Select From Dropdown",0,null,"Select",null,{"$f":"IF(H91=\"Second\",(F91*G91*H92*1),IF(H91=\"Third\",(F91*G91*H92*1),(F91*G91*H92*I92)))","v":0},{"$f":"(J93-J91)","v":0},"Select","Proposed Mitigation Type",{"$f":"(K91+L93)*M94","v":0}]
[null,null,null,null,null,null,null,{"$f":"IF(H91=\"Primary\",1,IF(H91=\"Second\",0.2,IF(H91=\"Third\",0.1,IF(H91=\"\",0))))","v":false},{"$f":"IF(AND(B91=\"Piedmont\",I91>0.0001,I91<0.1),0.41, IF(AND(B91=\"Piedmont\",I91>10), 2.45, IF(B91=\"Piedmont\",I91^0.39, IF(AND(B91=\"Coastal Plain\",I91>0.0001,I91<0.1),0.42,IF(AND(B91=\"Coastal Plain\",I91>10),2.4, IF(B91=\"Coastal Plain\",I91^0.38, IF(AND(B91=\"Mountain\",I91>0.0001,I91<0.1),0.36,IF(AND(B91=\"Mountain\",I91>10),2.75,IF(B91=\"Mountain\",I91^0.44)))))))))","v":false},null,null,{"$f":"IF(L91=\"Select\", 0,L91*0.1)","v":0},"Select from Dropdown"]
[null,{"$f":"B91","v":"Not Selected"},"Proposed","Not Selected","Select from Dropdown",0,null,{"$f":"H91","v":"Select"},{"$f":"I91","v":0},{"$f":"IF(H93=\"Second\",(F93*G93*H94*1),IF(H93=\"Third\",(F93*G93*H94*1),(F93*G93*H94*I94)))","v":0},null,{"$f":"K91*L92","v":0}]
[null,null,null,null,null,null,null,{"$f":"IF(H93=\"Primary\",1,IF(H93=\"Second\",0.2,IF(H93=\"Third\",0.1,0)))","v":0},{"$f":"IF(AND(B93=\"Piedmont\",I93>0.0001,I93<0.1),0.41, IF(AND(B93=\"Piedmont\",I93>10), 2.45, IF(B93=\"Piedmont\",I93^0.39, IF(AND(B93=\"Coastal Plain\",I93>0.0001,I93<0.1),0.42,IF(AND(B93=\"Coastal Plain\",I93>10),2.4, IF(B93=\"Coastal Plain\",I93^0.38, IF(AND(B93=\"Mountain\",I93>0.0001,I93<0.1),0.36,IF(AND(B93=\"Mountain\",I93>10),2.75,IF(B93=\"Mountain\",I93^0.44)))))))))","v":false},null,null,null,{"$f":"IF(M92=\"Mitigation Bank\",1.3,IF(M92=\"PRM Advanced Mitigation\",1.3,IF(M92=\"In Lieu Fee Released\",1.3, 1.5)))","v":1.5}]
[null,"Not Selected","Existing","Preliminary Resource Evaluation","Select From Dropdown",0,null,"Select",null,{"$f":"IF(H95=\"Second\",(F95*G95*H96*1),IF(H95=\"Third\",(F95*G95*H96*1),(F95*G95*H96*I96)))","v":0},{"$f":"(J97-J95)","v":0},"Select","Proposed Mitigation Type",{"$f":"(K95+L97)*M98","v":0}]
[null,null,null,null,null,null,null,{"$f":"IF(H95=\"Primary\",1,IF(H95=\"Second\",0.2,IF(H95=\"Third\",0.1,IF(H95=\"\",0))))","v":false},{"$f":"IF(AND(B95=\"Piedmont\",I95>0.0001,I95<0.1),0.41, IF(AND(B95=\"Piedmont\",I95>10), 2.45, IF(B95=\"Piedmont\",I95^0.39, IF(AND(B95=\"Coastal Plain\",I95>0.0001,I95<0.1),0.42,IF(AND(B95=\"Coastal Plain\",I95>10),2.4, IF(B95=\"Coastal Plain\",I95^0.38, IF(AND(B95=\"Mountain\",I95>0.0001,I95<0.1),0.36,IF(AND(B95=\"Mountain\",I95>10),2.75,IF(B95=\"Mountain\",I95^0.44)))))))))","v":false},null,null,{"$f":"IF(L95=\"Select\", 0,L95*0.1)","v":0},"Select from Dropdown"]
[null,{"$f":"B95","v":"Not Selected"},"Proposed","Not Selected","Select from Dropdown",0,null,{"$f":"H95","v":"Select"},{"$f":"I95","v":0},{"$f":"IF(H97=\"Second\",(F97*G97*H98*1),IF(H97=\"Third\",(F97*G97*H98*1),(F97*G97*H98*I98)))","v":0},null,{"$f":"K95*L96","v":0}]
[null,null,null,null,null,null,null,{"$f":"IF(H97=\"Primary\",1,IF(H97=\"Second\",0.2,IF(H97=\"Third\",0.1,0)))","v":0},{"$f":"IF(AND(B97=\"Piedmont\",I97>0.0001,I97<0.1),0.41, IF(AND(B97=\"Piedmont\",I97>10), 2.45, IF(B97=\"Piedmont\",I97^0.39, IF(AND(B97=\"Coastal Plain\",I97>0.0001,I97<0.1),0.42,IF(AND(B97=\"Coastal Plain\",I97>10),2.4, IF(B97=\"Coastal Plain\",I97^0.38, IF(AND(B97=\"Mountain\",I97>0.0001,I97<0.1),0.36,IF(AND(B97=\"Mountain\",I97>10),2.75,IF(B97=\"Mountain\",I97^0.44)))))))))","v":false},null,null,null,{"$f":"IF(M96=\"Mitigation Bank\",1.3,IF(M96=\"PRM Advanced Mitigation\",1.3,IF(M96=\"In Lieu Fee Released\",1.3, 1.5)))","v":1.5}]
[null,"Not Selected","Existing","Preliminary Resource Evaluation","Select From Dropdown",0,null,"Select",null,{"$f":"IF(H99=\"Second\",(F99*G99*H100*1),IF(H99=\"Third\",(F99*G99*H100*1),(F99*G99*H100*I100)))","v":0},{"$f":"(J101-J99)","v":0},"Select","Proposed Mitigation Type",{"$f":"(K99+L101)*M102","v":0}]
[null,null,null,null,null,null,null,{"$f":"IF(H99=\"Primary\",1,IF(H99=\"Second\",0.2,IF(H99=\"Third\",0.1,IF(H99=\"\",0))))","v":false},{"$f":"IF(AND(B99=\"Piedmont\",I99>0.0001,I99<0.1),0.41, IF(AND(B99=\"Piedmont\",I99>10), 2.45, IF(B99=\"Piedmont\",I99^0.39, IF(AND(B99=\"Coastal Plain\",I99>0.0001,I99<0.1),0.42,IF(AND(B99=\"Coastal Plain\",I99>10),2.4, IF(B99=\"Coastal Plain\",I99^0.38, IF(AND(B99=\"Mountain\",I99>0.0001,I99<0.1),0.36,IF(AND(B99=\"Mountain\",I99>10),2.75,IF(B99=\"Mountain\",I99^0.44)))))))))","v":false},null,null,{"$f":"IF(L99=\"Select\", 0,L99*0.1)","v":0},"Select from Dropdown"]
[null,{"$f":"B99","v":"Not Selected"},"Proposed","Not Selected","Select from Dropdown",0,null,{"$f":"H99","v":"Select"},{"$f":"I99","v":0},{"$f":"IF(H101=\"Second\",(F101*G101*H102*1),IF(H101=\"Third\",(F101*G101*H102*1),(F101*G101*H102*I102)))","v":0},null,{"$f":"K99*L100","v":0}]
[null,null,null,null,null,null,null,{"$f":"IF(H101=\"Primary\",1,IF(H101=\"Second\",0.2,IF(H101=\"Third\",0.1,0)))","v":0},{"$f":"IF(AND(B101=\"Piedmont\",I101>0.0001,I101<0.1),0.41, IF(AND(B101=\"Piedmont\",I101>10), 2.45, IF(B101=\"Piedmont\",I101^0.39, IF(AND(B101=\"Coastal Plain\",I101>0.0001,I101<0.1),0.42,IF(AND(B101=\"Coastal Plain\",I101>10),2.4, IF(B101=\"Coastal Plain\",I101^0.38, IF(AND(B101=\"Mountain\",I101>0.0001,I101<0.1),0.36,IF(AND(B101=\"Mountain\",I101>10),2.75,IF(B101=\"Mountain\",I101^0.44)))))))))","v":false},null,null,null,{"$f":"IF(M100=\"Mitigation Bank\",1.3,IF(M100=\"PRM Advanced Mitigation\",1.3,IF(M100=\"In Lieu Fee Released\",1.3, 1.5)))","v":1.5}]
[null,"Not Selected","Existing","Preliminary Resource Evaluation","Select From Dropdown",0,null,"Select",null,{"$f":"IF(H103=\"Second\",(F103*G103*H104*1),IF(H103=\"Third\",(F103*G103*H104*1),(F103*G103*H104*I104)))","v":0},{"$f":"(J105-J103)","v":0},"Select","Proposed Mitigation Type",{"$f":"(K103+L105)*M106","v":0}]
[null,null,null,null,null,null,null,{"$f":"IF(H103=\"Primary\",1,IF(H103=\"Second\",0.2,IF(H103=\"Third\",0.1,IF(H103=\"\",0))))","v":false},{"$f":"IF(AND(B103=\"Piedmont\",I103>0.0001,I103<0.1),0.41, IF(AND(B103=\"Piedmont\",I103>10), 2.45, IF(B103=\"Piedmont\",I103^0.39, IF(AND(B103=\"Coastal Plain\",I103>0.0001,I103<0.1),0.42,IF(AND(B103=\"Coastal Plain\",I103>10),2.4, IF(B103=\"Coastal Plain\",I103^0.38, IF(AND(B103=\"Mountain\",I103>0.0001,I103<0.1),0.36,IF(AND(B103=\"Mountain\",I103>10),2.75,IF(B103=\"Mountain\",I103^0.44)))))))))","v":false},null,null,{"$f":"IF(L103=\"Select\", 0,L103*0.1)","v":0},"Select from Dropdown"]
[null,{"$f":"B103","v":"Not Selected"},"Proposed","Not Selected","Select from Dropdown",0,null,{"$f":"H103","v":"Select"},{"$f":"I103","v":0},{"$f":"IF(H105=\"Second\",(F105*G105*H106*1),IF(H105=\"Third\",(F105*G105*H106*1),(F105*G105*H106*I106)))","v":0},null,{"$f":"K103*L104","v":0}]
[null,null,null,null,null,null,null,{"$f":"IF(H105=\"Primary\",1,IF(H105=\"Second\",0.2,IF(H105=\"Third\",0.1,0)))","v":0},{"$f":"IF(AND(B105=\"Piedmont\",I105>0.0001,I105<0.1),0.41, IF(AND(B105=\"Piedmont\",I105>10), 2.45, IF(B105=\"Piedmont\",I105^0.39, IF(AND(B105=\"Coastal Plain\",I105>0.0001,I105<0.1),0.42,IF(AND(B105=\"Coastal Plain\",I105>10),2.4, IF(B105=\"Coastal Plain\",I105^0.38, IF(AND(B105=\"Mountain\",I105>0.0001,I105<0.1),0.36,IF(AND(B105=\"Mountain\",I105>10),2.75,IF(B105=\"Mountain\",I105^0.44)))))))))","v":false},null,null,null,{"$f":"IF(M104=\"Mitigation Bank\",1.3,IF(M104=\"PRM Advanced Mitigation\",1.3,IF(M104=\"In Lieu Fee Released\",1.3, 1.5)))","v":1.5}]
[null,"Not Selected","Existing","Preliminary Resource Evaluation","Select From Dropdown",0,null,"Select",null,{"$f":"IF(H107=\"Second\",(F107*G107*H108*1),IF(H107=\"Third\",(F107*G107*H108*1),(F107*G107*H108*I108)))","v":0},{"$f":"(J109-J107)","v":0},"Select","Proposed Mitigation Type",{"$f":"(K107+L109)*M110","v":0}]
[null,null,null,null,null,null,null,{"$f":"IF(H107=\"Primary\",1,IF(H107=\"Second\",0.2,IF(H107=\"Third\",0.1,IF(H107=\"\",0))))","v":false},{"$f":"IF(AND(B107=\"Piedmont\",I107>0.0001,I107<0.1),0.41, IF(AND(B107=\"Piedmont\",I107>10), 2.45, IF(B107=\"Piedmont\",I107^0.39, IF(AND(B107=\"Coastal Plain\",I107>0.0001,I107<0.1),0.42,IF(AND(B107=\"Coastal Plain\",I107>10),2.4, IF(B107=\"Coastal Plain\",I107^0.38, IF(AND(B107=\"Mountain\",I107>0.0001,I107<0.1),0.36,IF(AND(B107=\"Mountain\",I107>10),2.75,IF(B107=\"Mountain\",I107^0.44)))))))))","v":false},null,null,{"$f":"IF(L107=\"Select\", 0,L107*0.1)","v":0},"Select from Dropdown"]
[null,{"$f":"B107","v":"Not Selected"},"Proposed","Not Selected","Select from Dropdown",0,null,{"$f":"H107","v":"Select"},{"$f":"I107","v":0},{"$f":"IF(H109=\"Second\",(F109*G109*H110*1),IF(H109=\"Third\",(F109*G109*H110*1),(F109*G109*H110*I110)))","v":0},null,{"$f":"K107*L108","v":0}]
[null,null,null,null,null,null,null,{"$f":"IF(H109=\"Primary\",1,IF(H109=\"Second\",0.2,IF(H109=\"Third\",0.1,0)))","v":0},{"$f":"IF(AND(B109=\"Piedmont\",I109>0.0001,I109<0.1),0.41, IF(AND(B109=\"Piedmont\",I109>10), 2.45, IF(B109=\"Piedmont\",I109^0.39, IF(AND(B109=\"Coastal Plain\",I109>0.0001,I109<0.1),0.42,IF(AND(B109=\"Coastal Plain\",I109>10),2.4, IF(B109=\"Coastal Plain\",I109^0.38, IF(AND(B109=\"Mountain\",I109>0.0001,I109<0.1),0.36,IF(AND(B109=\"Mountain\",I109>10),2.75,IF(B109=\"Mountain\",I109^0.44)))))))))","v":false},null,null,null,{"$f":"IF(M108=\"Mitigation Bank\",1.3,IF(M108=\"PRM Advanced Mitigation\",1.3,IF(M108=\"In Lieu Fee Released\",1.3, 1.5)))","v":1.5}]
[null,"Not Selected","Existing","Preliminary Resource Evaluation","Select From Dropdown",0,null,"Select",null,{"$f":"IF(H111=\"Second\",(F111*G111*H112*1),IF(H111=\"Third\",(F111*G111*H112*1),(F111*G111*H112*I112)))","v":0},{"$f":"(J113-J111)","v":0},"Select","Proposed Mitigation Type",{"$f":"(K111+L113)*M114","v":0}]
[null,null,null,null,null,null,null,{"$f":"IF(H111=\"Primary\",1,IF(H111=\"Second\",0.2,IF(H111=\"Third\",0.1,IF(H111=\"\",0))))","v":false},{"$f":"IF(AND(B111=\"Piedmont\",I111>0.0001,I111<0.1),0.41, IF(AND(B111=\"Piedmont\",I111>10), 2.45, IF(B111=\"Piedmont\",I111^0.39, IF(AND(B111=\"Coastal Plain\",I111>0.0001,I111<0.1),0.42,IF(AND(B111=\"Coastal Plain\",I111>10),2.4, IF(B111=\"Coastal Plain\",I111^0.38, IF(AND(B111=\"Mountain\",I111>0.0001,I111<0.1),0.36,IF(AND(B111=\"Mountain\",I111>10),2.75,IF(B111=\"Mountain\",I111^0.44)))))))))","v":false},null,null,{"$f":"IF(L111=\"Select\", 0,L111*0.1)","v":0},"Select from Dropdown"]
[null,{"$f":"B111","v":"Not Selected"},"Proposed","Not Selected","Select from Dropdown",0,null,{"$f":"H111","v":"Select"},{"$f":"I111","v":0},{"$f":"IF(H113=\"Second\",(F113*G113*H114*1),IF(H113=\"Third\",(F113*G113*H114*1),(F113*G113*H114*I114)))","v":0},null,{"$f":"K111*L112","v":0}]
[null,null,null,null,null,null,null,{"$f":"IF(H113=\"Primary\",1,IF(H113=\"Second\",0.2,IF(H113=\"Third\",0.1,0)))","v":0},{"$f":"IF(AND(B113=\"Piedmont\",I113>0.0001,I113<0.1),0.41, IF(AND(B113=\"Piedmont\",I113>10), 2.45, IF(B113=\"Piedmont\",I113^0.39, IF(AND(B113=\"Coastal Plain\",I113>0.0001,I113<0.1),0.42,IF(AND(B113=\"Coastal Plain\",I113>10),2.4, IF(B113=\"Coastal Plain\",I113^0.38, IF(AND(B113=\"Mountain\",I113>0.0001,I113<0.1),0.36,IF(AND(B113=\"Mountain\",I113>10),2.75,IF(B113=\"Mountain\",I113^0.44)))))))))","v":false},null,null,null,{"$f":"IF(M112=\"Mitigation Bank\",1.3,IF(M112=\"PRM Advanced Mitigation\",1.3,IF(M112=\"In Lieu Fee Released\",1.3, 1.5)))","v":1.5}]
[null,"Not Selected","Existing","Preliminary Resource Evaluation","Select From Dropdown",0,null,"Select",null,{"$f":"IF(H115=\"Second\",(F115*G115*H116*1),IF(H115=\"Third\",(F115*G115*H116*1),(F115*G115*H116*I116)))","v":0},{"$f":"(J117-J115)","v":0},"Select","Proposed Mitigation Type",{"$f":"(K115+L117)*M118","v":0}]
[null,null,null,null,null,null,null,{"$f":"IF(H115=\"Primary\",1,IF(H115=\"Second\",0.2,IF(H115=\"Third\",0.1,IF(H115=\"\",0))))","v":false},{"$f":"IF(AND(B115=\"Piedmont\",I115>0.0001,I115<0.1),0.41, IF(AND(B115=\"Piedmont\",I115>10), 2.45, IF(B115=\"Piedmont\",I115^0.39, IF(AND(B115=\"Coastal Plain\",I115>0.0001,I115<0.1),0.42,IF(AND(B115=\"Coastal Plain\",I115>10),2.4, IF(B115=\"Coastal Plain\",I115^0.38, IF(AND(B115=\"Mountain\",I115>0.0001,I115<0.1),0.36,IF(AND(B115=\"Mountain\",I115>10),2.75,IF(B115=\"Mountain\",I115^0.44)))))))))","v":false},null,null,{"$f":"IF(L115=\"Select\", 0,L115*0.1)","v":0},"Select from Dropdown"]
[null,{"$f":"B115","v":"Not Selected"},"Proposed","Not Selected","Select from Dropdown",0,null,{"$f":"H115","v":"Select"},{"$f":"I115","v":0},{"$f":"IF(H117=\"Second\",(F117*G117*H118*1),IF(H117=\"Third\",(F117*G117*H118*1),(F117*G117*H118*I118)))","v":0},null,{"$f":"K115*L116","v":0}]
[null,null,null,null,null,null,null,{"$f":"IF(H117=\"Primary\",1,IF(H117=\"Second\",0.2,IF(H117=\"Third\",0.1,0)))","v":0},{"$f":"IF(AND(B117=\"Piedmont\",I117>0.0001,I117<0.1),0.41, IF(AND(B117=\"Piedmont\",I117>10), 2.45, IF(B117=\"Piedmont\",I117^0.39, IF(AND(B117=\"Coastal Plain\",I117>0.0001,I117<0.1),0.42,IF(AND(B117=\"Coastal Plain\",I117>10),2.4, IF(B117=\"Coastal Plain\",I117^0.38, IF(AND(B117=\"Mountain\",I117>0.0001,I117<0.1),0.36,IF(AND(B117=\"Mountain\",I117>10),2.75,IF(B117=\"Mountain\",I117^0.44)))))))))","v":false},null,null,null,{"$f":"IF(M116=\"Mitigation Bank\",1.3,IF(M116=\"PRM Advanced Mitigation\",1.3,IF(M116=\"In Lieu Fee Released\",1.3, 1.5)))","v":1.5}]
[null,"Not Selected","Existing","Preliminary Resource Evaluation","Select From Dropdown",0,null,"Select",null,{"$f":"IF(H119=\"Second\",(F119*G119*H120*1),IF(H119=\"Third\",(F119*G119*H120*1),(F119*G119*H120*I120)))","v":0},{"$f":"(J121-J119)","v":0},"Select","Proposed Mitigation Type",{"$f":"(K119+L121)*M122","v":0}]
[null,null,null,null,null,null,null,{"$f":"IF(H119=\"Primary\",1,IF(H119=\"Second\",0.2,IF(H119=\"Third\",0.1,IF(H119=\"\",0))))","v":false},{"$f":"IF(AND(B119=\"Piedmont\",I119>0.0001,I119<0.1),0.41, IF(AND(B119=\"Piedmont\",I119>10), 2.45, IF(B119=\"Piedmont\",I119^0.39, IF(AND(B119=\"Coastal Plain\",I119>0.0001,I119<0.1),0.42,IF(AND(B119=\"Coastal Plain\",I119>10),2.4, IF(B119=\"Coastal Plain\",I119^0.38, IF(AND(B119=\"Mountain\",I119>0.0001,I119<0.1),0.36,IF(AND(B119=\"Mountain\",I119>10),2.75,IF(B119=\"Mountain\",I119^0.44)))))))))","v":false},null,null,{"$f":"IF(L119=\"Select\", 0,L119*0.1)","v":0},"Select from Dropdown"]
[null,{"$f":"B119","v":"Not Selected"},"Proposed","Not Selected","Select from Dropdown",0,null,{"$f":"H119","v":"Select"},{"$f":"I119","v":0},{"$f":"IF(H121=\"Second\",(F121*G121*H122*1),IF(H121=\"Third\",(F121*G121*H122*1),(F121*G121*H122*I122)))","v":0},null,{"$f":"K119*L120","v":0}]
[null,null,null,null,null,null,null,{"$f":"IF(H121=\"Primary\",1,IF(H121=\"Second\",0.2,IF(H121=\"Third\",0.1,0)))","v":0},{"$f":"IF(AND(B121=\"Piedmont\",I121>0.0001,I121<0.1),0.41, IF(AND(B121=\"Piedmont\",I121>10), 2.45, IF(B121=\"Piedmont\",I121^0.39, IF(AND(B121=\"Coastal Plain\",I121>0.0001,I121<0.1),0.42,IF(AND(B121=\"Coastal Plain\",I121>10),2.4, IF(B121=\"Coastal Plain\",I121^0.38, IF(AND(B121=\"Mountain\",I121>0.0001,I121<0.1),0.36,IF(AND(B121=\"Mountain\",I121>10),2.75,IF(B121=\"Mountain\",I121^0.44)))))))))","v":false},null,null,null,{"$f":"IF(M120=\"Mitigation Bank\",1.3,IF(M120=\"PRM Advanced Mitigation\",1.3,IF(M120=\"In Lieu Fee Released\",1.3, 1.5)))","v":1.5}]
[null,"Not Selected","Existing","Preliminary Resource Evaluation","Select From Dropdown",0,null,"Select",null,{"$f":"IF(H123=\"Second\",(F123*G123*H124*1),IF(H123=\"Third\",(F123*G123*H124*1),(F123*G123*H124*I124)))","v":0},{"$f":"(J125-J123)","v":0},"Select","Proposed Mitigation Type",{"$f":"(K123+L125)*M126","v":0}]
[null,null,null,null,null,null,null,{"$f":"IF(H123=\"Primary\",1,IF(H123=\"Second\",0.2,IF(H123=\"Third\",0.1,IF(H123=\"\",0))))","v":false},{"$f":"IF(AND(B123=\"Piedmont\",I123>0.0001,I123<0.1),0.41, IF(AND(B123=\"Piedmont\",I123>10), 2.45, IF(B123=\"Piedmont\",I123^0.39, IF(AND(B123=\"Coastal Plain\",I123>0.0001,I123<0.1),0.42,IF(AND(B123=\"Coastal Plain\",I123>10),2.4, IF(B123=\"Coastal Plain\",I123^0.38, IF(AND(B123=\"Mountain\",I123>0.0001,I123<0.1),0.36,IF(AND(B123=\"Mountain\",I123>10),2.75,IF(B123=\"Mountain\",I123^0.44)))))))))","v":false},null,null,{"$f":"IF(L123=\"Select\", 0,L123*0.1)","v":0},"Select from Dropdown"]
[null,{"$f":"B123","v":"Not Selected"},"Proposed","Not Selected","Select from Dropdown",0,null,{"$f":"H123","v":"Select"},{"$f":"I123","v":0},{"$f":"IF(H125=\"Second\",(F125*G125*H126*1),IF(H125=\"Third\",(F125*G125*H126*1),(F125*G125*H126*I126)))","v":0},null,{"$f":"K123*L124","v":0}]
[null,null,null,null,null,null,null,{"$f":"IF(H125=\"Primary\",1,IF(H125=\"Second\",0.2,IF(H125=\"Third\",0.1,0)))","v":0},{"$f":"IF(AND(B125=\"Piedmont\",I125>0.0001,I125<0.1),0.41, IF(AND(B125=\"Piedmont\",I125>10), 2.45, IF(B125=\"Piedmont\",I125^0.39, IF(AND(B125=\"Coastal Plain\",I125>0.0001,I125<0.1),0.42,IF(AND(B125=\"Coastal Plain\",I125>10),2.4, IF(B125=\"Coastal Plain\",I125^0.38, IF(AND(B125=\"Mountain\",I125>0.0001,I125<0.1),0.36,IF(AND(B125=\"Mountain\",I125>10),2.75,IF(B125=\"Mountain\",I125^0.44)))))))))","v":false},null,null,null,{"$f":"IF(M124=\"Mitigation Bank\",1.3,IF(M124=\"PRM Advanced Mitigation\",1.3,IF(M124=\"In Lieu Fee Released\",1.3, 1.5)))","v":1.5}]

{"sheet":"3_Stream Mit Calc_StrmChannels","index":2,"n_rows":86,"n_cols":17,"rows_kept":86,"cut":false,"hidden":false,"merged":[[72,13,73,14],[75,13,75,14],[76,13,77,14],[55,13,55,14],[56,13,57,14],[59,13,59,14],[60,13,61,14],[63,13,63,14],[64,13,65,14],[67,13,67,14],[68,13,69,14],[71,13,71,14],[15,13,15,14],[16,13,17,14],[19,13,19,14],[20,13,21,14],[23,13,23,14],[24,13,25,14],[31,13,31,14],[32,13,33,14],[35,13,35,14],[27,13,27,14],[28,13,29,14],[8,11,9,11],[8,4,9,4],[8,9,9,9],[8,8,9,8],[10,9,11,9],[12,9,13,9],[10,16,13,18],[7,0,7,10],[12,12,13,12],[10,15,13,15],[11,13,11,14],[8,13,9,14],[12,13,13,14],[7,11,7,14],[8,1,9,1],[10,1,11,1],[12,1,13,1],[12,2,13,2],[10,2,11,2],[10,5,11,5],[12,6,13,6],[10,6,11,6],[10,4,11,4],[12,4,13,4],[8,10,9,10],[48,9,49,9],[46,9,47,9],[10,10,13,10],[44,9,45,9],[44,5,45,5],[50,10,53,10],[56,5,57,5],[56,4,57,4],[56,6,57,6],[56,9,57,9],[54,9,55,9],[52,6,53,6],[52,9,53,9],[50,9,51,9],[12,5,13,5],[42,9,43,9],[14,3,15,3],[16,3,17,3],[38,9,39,9],[40,9,41,9],[34,9,35,9],[54,10,57,10],[46,10,49,10],[14,4,15,4],[30,10,33,10],[34,10,37,10],[22,6,23,6],[22,9,23,9],[22,10,25,10],[48,5,49,5],[48,4,49,4],[48,6,49,6],[46,3,47,3],[46,4,47,4],[44,4,45,4],[40,4,41,4],[24,3,25,3],[18,3,19,3],[20,3,21,3],[28,9,29,9],[82,0,85,0],[82,1,83,1],[82,2,83,2],[82,3,83,3],[82,4,83,4],[82,5,83,5],[82,6,83,6],[82,9,83,9],[82,10,85,10],[84,1,85,1],[84,2,85,2],[84,3,85,3],[84,4,85,4],[84,5,85,5],[84,6,85,6],[84,9,85,9],[58,15,61,15],[60,2,61,2],[60,3,61,3],[60,4,61,4],[58,0,61,0],[58,2,59,2],[58,3,59,3],[58,4,59,4],[58,5,59,5],[60,6,61,6],[60,9,61,9],[60,12,61,12],[58,1,59,1],[60,1,61,1],[58,6,59,6],[58,9,59,9],[58,10,61,10],[60,5,61,5],[66,15,69,15],[68,2,69,2],[68,3,69,3],[68,4,69,4],[68,5,69,5],[68,6,69,6],[68,9,69,9],[68,12,69,12],[66,2,67,2],[66,3,67,3],[66,4,67,4],[66,5,67,5],[66,6,67,6],[66,9,67,9],[66,10,69,10],[4,5,4,6],[5,5,5,6],[6,5,6,6],[4,7,4,10],[5,7,5,10],[6,7,6,10],[3,5,3,6],[3,7,3,10],[3,0,3,1],[3,2,3,4],[4,0,4,1],[4,2,4,4],[5,0,5,1],[5,2,5,4],[6,0,6,1],[6,2,6,4],[26,0,29,0],[26,2,27,2],[26,5,27,5],[28,2,29,2],[28,5,29,5],[26,4,27,4],[28,4,29,4],[28,6,29,6],[26,6,27,6],[54,15,57,15],[46,5,47,5],[32,12,33,12],[38,4,39,4],[42,5,43,5],[42,10,45,10],[44,6,45,6],[38,6,39,6],[38,10,41,10],[40,6,41,6],[42,4,43,4],[42,6,43,6],[38,5,39,5],[43,13,43,14],[44,13,45,14],[47,13,47,14],[48,13,49,14],[51,13,51,14],[52,13,53,14],[26,3,27,3],[28,3,29,3],[22,15,25,15],[34,5,35,5],[36,12,37,12],[30,1,31,1],[32,1,33,1],[42,3,43,3],[40,5,41,5],[30,5,31,5],[34,4,35,4],[36,4,37,4],[34,6,35,6],[38,3,39,3],[32,3,33,3],[30,9,31,9],[30,15,33,15],[30,3,31,3],[34,2,35,2],[36,2,37,2],[36,5,37,5],[36,9,37,9],[30,2,31,2],[34,3,35,3],[36,3,37,3],[32,2,33,2],[32,5,33,5],[32,9,33,9],[30,4,31,4],[30,6,31,6],[32,4,33,4],[32,6,33,6],[36,6,37,6],[36,13,37,14],[39,13,39,14],[40,13,41,14],[30,0,33,0],[18,2,19,2],[24,2,25,2],[24,4,25,4],[14,15,17,15],[18,15,21,15],[26,15,29,15],[34,1,35,1],[36,1,37,1],[38,1,39,1],[40,1,41,1],[24,1,25,1],[26,1,27,1],[28,1,29,1],[22,12,23,12],[26,12,27,12],[30,12,31,12],[34,12,35,12],[38,12,39,12],[28,12,29,12],[24,12,25,12],[70,15,73,15],[72,2,73,2],[72,3,73,3],[72,4,73,4],[72,5,73,5],[72,6,73,6],[72,9,73,9],[72,12,73,12],[34,15,37,15],[38,15,41,15],[46,15,49,15],[50,15,53,15],[42,15,45,15],[44,12,45,12],[52,12,53,12],[40,12,41,12],[46,6,47,6],[70,6,71,6],[70,9,71,9],[62,4,63,4],[62,5,63,5],[62,6,63,6],[62,9,63,9],[62,10,65,10],[70,10,73,10],[50,3,51,3],[52,3,53,3],[52,2,53,2],[52,5,53,5],[52,4,53,4],[50,2,51,2],[50,5,51,5],[50,4,51,4],[50,6,51,6],[54,2,55,2],[54,5,55,5],[54,4,55,4],[54,6,55,6],[54,3,55,3],[34,0,37,0],[62,1,63,1],[44,2,45,2],[78,0,81,0],[78,2,79,2],[78,3,79,3],[78,4,79,4],[78,5,79,5],[78,6,79,6],[80,2,81,2],[80,3,81,3],[80,4,81,4],[80,5,81,5],[80,6,81,6],[74,0,77,0],[74,1,75,1],[76,1,77,1],[50,0,53,0],[66,0,69,0],[62,0,65,0],[68,1,69,1],[70,0,73,0],[54,0,57,0],[64,1,65,1],[50,1,51,1],[52,1,53,1],[38,0,41,0],[66,1,67,1],[48,3,49,3],[56,2,57,2],[46,2,47,2],[40,2,41,2],[38,2,39,2],[40,3,41,3],[48,2,49,2],[56,3,57,3],[54,1,55,1],[56,1,57,1],[62,2,63,2],[62,3,63,3],[42,1,43,1],[44,1,45,1],[46,1,47,1],[48,1,49,1],[46,0,49,0],[42,0,45,0],[76,2,77,2],[76,3,77,3],[76,4,77,4],[76,5,77,5],[80,1,81,1],[70,1,71,1],[72,1,73,1],[70,2,71,2],[70,3,71,3],[70,4,71,4],[70,5,71,5],[74,2,75,2],[78,1,79,1],[82,15,85,15],[84,12,85,12],[74,3,75,3],[74,4,75,4],[74,5,75,5],[74,6,75,6],[74,9,75,9],[74,10,77,10],[74,15,77,15],[76,6,77,6],[76,9,77,9],[76,12,77,12],[78,15,81,15],[80,12,81,12],[82,12,83,12],[79,13,79,14],[80,13,81,14],[83,13,83,14],[84,13,85,14],[78,12,79,12],[78,9,79,9],[78,10,81,10],[80,9,81,9],[62,15,65,15],[64,2,65,2],[64,3,65,3],[64,4,65,4],[64,5,65,5],[64,6,65,6],[64,9,65,9],[64,12,65,12],[14,16,17,18],[18,16,21,18],[22,16,25,18],[26,16,29,18],[42,2,43,2],[44,3,45,3],[14,2,15,2],[14,5,15,5],[14,9,15,9],[16,2,17,2],[16,5,17,5],[16,9,17,9],[16,12,17,12],[20,12,21,12],[18,5,19,5],[18,9,19,9],[2,12,3,18],[4,12,6,18],[0,0,1,18],[7,16,9,18],[14,1,15,1],[16,1,17,1],[18,1,19,1],[20,1,21,1],[22,1,23,1],[14,0,17,0],[20,5,21,5],[10,3,11,3],[12,3,13,3],[8,2,9,2],[8,3,9,3],[8,5,9,5],[8,6,9,6],[8,7,9,7],[22,0,25,0],[22,2,23,2],[22,3,23,3],[22,4,23,4],[22,5,23,5],[2,0,2,10],[7,15,9,15],[8,12,9,12],[18,0,21,0],[20,2,21,2],[20,9,21,9],[10,0,13,0],[26,10,29,10],[8,0,9,0],[24,5,25,5],[24,6,25,6],[24,9,25,9],[14,6,15,6],[14,10,17,10],[16,4,17,4],[16,6,17,6],[18,4,19,4],[18,6,19,6],[18,10,21,10],[20,4,21,4],[20,6,21,6],[26,9,27,9],[10,12,11,12],[14,12,15,12],[18,12,19,12],[78,16,81,18],[82,16,85,18],[58,16,61,18],[62,16,65,18],[66,16,69,18],[70,16,73,18],[30,16,33,18],[34,16,37,18],[38,16,41,18],[42,16,45,18],[46,16,49,18],[74,16,77,18],[54,16,57,18],[50,16,53,18],[42,12,43,12],[46,12,47,12],[50,12,51,12],[54,12,55,12],[58,12,59,12],[62,12,63,12],[66,12,67,12],[70,12,71,12],[74,12,75,12],[48,12,49,12],[56,12,57,12]]}
["STREAM MITIGATION CALCULATOR for Stream Channels"]
[]
["BACKGROUND INFORMATION  ",null,null,null,null,null,null,null,null,null,null,null,"  TOTAL STREAM GAINS from Stream Channels (Functional Feet)"]
["Corps Project ID #:",null,"NAB-2023-88552",null,null,"Corps PM:",null,"James Brown"]
["Project Name:",null,"Panther Branch Mitigation ",null,null,"Date:",null,"2023-02-26",null,null,null,null,{"$f":"SUM(P11:P86)","v":693.41631250917646}]
["Lat/Long:",null,"38.58960, -76.9567",null,null,"Sponsor:",null,"Acme Airports"]
["County:",null,"Baltimore",null,null,"Collaborators: ",null,"DBT, CKL"]
["Raw Change in Reach Value (Functional Feet) ",null,null,null,null,null,null,null,null,null,null," Adjustments",null,null,null,"Stream Gains (Functional Feet)","REMARKS                (Incude reach coordinates)"]
["Reach Name","Physiographic Region","Evaluation","Activity","Resource Type","Length (Feet)","Stream Quality","Channel Thread","Drainage Area (sqmi)","Raw Reach Value (Functional Feet)","Raw Change in Value (Functional Feet)","Change in Reach Length Adjustment","Site Sensitivity","Site Protection"]
[]
["reach 1 small perennial ex","Piedmont","Existing","Preliminary Resource Evaluation","Perennial Headwater",1000,0.35,"Primary",0.5,{"$f":"IF(H11=\"Second\",(F11*G11*H12*1), IF(H11=\"Third\",(F11*G11*H12*1), (F11*G11*H12*I12)))","v":267.09536156809787},{"$f":" J13-J11","v":305.25184179211175},{"$f":"IF(F11>F13, \"Length Loss\", IF(F11<F13, \"Length Gain\", IF(F11=F13, \"No Change\")))","v":"No Change"},0.1,"Agricultural Easement","Easement",{"$f":"IF(D13=\"Restoration/Enhancement\",SUM(K11,L14,M13,N13),IF(D13=\"Preservation\",((0.1*J13)+M13+N13),\"NA\"))","v":365.77702597132293},"36.90899, -76.99889. Main channel of reach 1"]
[null,null,null,null,null,null,null,{"$f":"IF(H11=\"Primary\",1,IF(H11=\"Second\",0.2,IF(H11=\"Third\",0.1,IF(H11=\"Select\",0))))","v":1},{"$f":"IF(AND(B11=\"Piedmont\",I11>0.0001,I11<0.1),0.41, IF(AND(B11=\"Piedmont\",I11>10), 2.45, IF(B11=\"Piedmont\",I11^0.39, IF(AND(B11=\"Coastal Plain\",I11>0.0001,I11<0.1),0.42,IF(AND(B11=\"Coastal Plain\",I11>10),2.4, IF(B11=\"Coastal Plain\",I11^0.38, IF(AND(B11=\"Mountain\",I11>0.0001,I11<0.1),0.36,IF(AND(B11=\"Mountain\",I11>10),2.75,IF(B11=\"Mountain\",I11^0.44)))))))))","v":0.76312960448027956},null,null,{"$f":"F13-F11","v":0},null,{"$f":"IF(AND(N11=\"No Existing Protection\",O11=\"Deed Restriction\"), 0.02, IF(AND(N11=\"No Existing Protection\",O11=\"Easement\"), 0.05, IF(AND(N11=\"No Existing Protection\", O11=\"Accredited Easement\"), 0.07, IF(AND(N11=\"No Existing Protection\", O11=\"Fee Simple to Conservation Holder\"), 0.09, IF(AND(N11=\"Agricultural Easement\",O11=\"Deed Restriction\"), 0.01, IF(AND(N11=\"Agricultural Easement\",O11=\"Easement\"), 0.04, IF(AND(N11=\"Agricultural Easement\", O11=\"Accredited Easement\"), 0.06, IF(AND(N11=\"Agricultural Easement\", O11=\"Fee Simple to Conservation Holder\"), 0.09, IF(AND(N11=\"Environmental Easement\",O11=\"Deed Restriction\"), 0, IF(AND(N11=\"Environmental Easement\", O11=\"Easement\"), 0.02, IF(AND(N11=\"Environmental Easement\", O11=\"Accredited Easement\"), 0.03, IF(AND(N11=\"Public Land\", O11=\"Public Land MOA\"), 0.02, 0))))))))))))","v":0.04}]
[null,{"$f":"B11","v":"Piedmont"},"Proposed","Restoration/Enhancement","Perennial Headwater",1000,0.75,{"$f":"H11","v":"Primary"},{"$f":"I11","v":0.5},{"$f":"IF(H13=\"Second\",(F13*G13*H14*1), IF(H13=\"Third\",(F13*G13*H14*1), (F13*G13*H14*I14)))","v":572.34720336020962},null,0.5,{"$f":"IF(D13=\"Preservation\",((J13*0.1)*M11),(K11+L14)*M11)","v":30.525184179211177},{"$f":"IF(H11=\"Second\",(J13*N12),IF(H11=\"Third\",(J13*N12),(J13/I14*N12)))","v":29.999999999999996}]
[null,null,null,null,null,null,null,{"$f":"IF(H13=\"Primary\",1,IF(H13=\"Second\",0.2,IF(H13=\"Third\",0.1,IF(H13=\"Select\",0))))","v":1},{"$f":"IF(AND(B13=\"Piedmont\",I13>0.0001,I13<0.1),0.41, IF(AND(B13=\"Piedmont\",I13>10), 2.45, IF(B13=\"Piedmont\",I13^0.39, IF(AND(B13=\"Coastal Plain\",I13>0.0001,I13<0.1),0.42,IF(AND(B13=\"Coastal Plain\",I13>10),2.4, IF(B13=\"Coastal Plain\",I13^0.38, IF(AND(B13=\"Mountain\",I13>0.0001,I13<0.1),0.36,IF(AND(B13=\"Mountain\",I13>10),2.75,IF(B13=\"Mountain\",I13^0.44)))))))))","v":0.76312960448027956},null,null,{"$f":"IF(AND(H11=\"Primary\",L11=\"Length Loss\"), L12*G11*I12*L13*-1,IF(AND(H11=\"Primary\", L11=\"Length Gain\"),L12*G13*I14*L13*-1,0))","v":0}]
["Reach 2 mid perennial example","Piedmont","Existing","Preliminary Resource Evaluation","Perennial Headwater",325,0.35,"Primary",3,{"$f":"IF(H15=\"Second\",(F15*G15*H16*1), IF(H15=\"Third\",(F15*G15*H16*1), (F15*G15*H16*I16)))","v":174.59375065511074},{"$f":" J17-J15","v":199.53571503441231},{"$f":"IF(F15>F17, \"Length Loss\", IF(F15<F17, \"Length Gain\", IF(F15=F17, \"No Change\")))","v":"No Change"},0.1,"Agricultural Easement","Easement",{"$f":"IF(D17=\"Restoration/Enhancement\",SUM(K15,L18,M17,N17),IF(D17=\"Preservation\",((0.1*J17)+M17+N17),\"NA\"))","v":229.23928653785353},"36.90888, -76.99771"]
[null,null,null,null,null,null,null,{"$f":"IF(H15=\"Primary\",1,IF(H15=\"Second\",0.2,IF(H15=\"Third\",0.1,IF(H15=\"Select\",0))))","v":1},{"$f":"IF(AND(B15=\"Piedmont\",I15>0.0001,I15<0.1),0.41, IF(AND(B15=\"Piedmont\",I15>10), 2.45, IF(B15=\"Piedmont\",I15^0.39, IF(AND(B15=\"Coastal Plain\",I15>0.0001,I15<0.1),0.42,IF(AND(B15=\"Coastal Plain\",I15>10),2.4, IF(B15=\"Coastal Plain\",I15^0.38, IF(AND(B15=\"Mountain\",I15>0.0001,I15<0.1),0.36,IF(AND(B15=\"Mountain\",I15>10),2.75,IF(B15=\"Mountain\",I15^0.44)))))))))","v":1.5348901156493253},null,null,{"$f":"F17-F15","v":0},null,{"$f":"IF(AND(N15=\"No Existing Protection\",O15=\"Deed Restriction\"), 0.02, IF(AND(N15=\"No Existing Protection\",O15=\"Easement\"), 0.05, IF(AND(N15=\"No Existing Protection\", O15=\"Accredited Easement\"), 0.07, IF(AND(N15=\"No Existing Protection\", O15=\"Fee Simple to Conservation Holder\"), 0.09, IF(AND(N15=\"Agricultural Easement\",O15=\"Deed Restriction\"), 0.01, IF(AND(N15=\"Agricultural Easement\",O15=\"Easement\"), 0.04, IF(AND(N15=\"Agricultural Easement\", O15=\"Accredited Easement\"), 0.06, IF(AND(N15=\"Agricultural Easement\", O15=\"Fee Simple to Conservation Holder\"), 0.09, IF(AND(N15=\"Environmental Easement\",O15=\"Deed Restriction\"), 0, IF(AND(N15=\"Environmental Easement\", O15=\"Easement\"), 0.02, IF(AND(N15=\"Environmental Easement\", O15=\"Accredited Easement\"), 0.03, IF(AND(N15=\"Public Land\", O15=\"Public Land MOA\"), 0.02, 0))))))))))))","v":0.04}]
[null,{"$f":"B15","v":"Piedmont"},"Proposed","Restoration/Enhancement","Perennial Headwater",325,0.75,{"$f":"H15","v":"Primary"},{"$f":"I15","v":3},{"$f":"IF(H17=\"Second\",(F17*G17*H18*1), IF(H17=\"Third\",(F17*G17*H18*1), (F17*G17*H18*I18)))","v":374.12946568952304},null,0.5,{"$f":"IF(D17=\"Preservation\",((J17*0.1)*M15),(K15+L18)*M15)","v":19.953571503441232},{"$f":"IF(H15=\"Second\",(J17*N16),IF(H15=\"Third\",(J17*N16),(J17/I18*N16)))","v":9.75}]
[null,null,null,null,null,null,null,{"$f":"IF(H17=\"Primary\",1,IF(H17=\"Second\",0.2,IF(H17=\"Third\",0.1,IF(H17=\"Select\",0))))","v":1},{"$f":"IF(AND(B17=\"Piedmont\",I17>0.0001,I17<0.1),0.41, IF(AND(B17=\"Piedmont\",I17>10), 2.45, IF(B17=\"Piedmont\",I17^0.39, IF(AND(B17=\"Coastal Plain\",I17>0.0001,I17<0.1),0.42,IF(AND(B17=\"Coastal Plain\",I17>10),2.4, IF(B17=\"Coastal Plain\",I17^0.38, IF(AND(B17=\"Mountain\",I17>0.0001,I17<0.1),0.36,IF(AND(B17=\"Mountain\",I17>10),2.75,IF(B17=\"Mountain\",I17^0.44)))))))))","v":1.5348901156493253},null,null,{"$f":"IF(AND(H15=\"Primary\",L15=\"Length Loss\"), L16*G15*I16*L17*-1,IF(AND(H15=\"Primary\", L15=\"Length Gain\"),L16*G17*I18*L17*-1,0))","v":0}]
["Reach 1 Second channel","Piedmont","Existing","Preliminary Resource Evaluation","Perennial Headwater",1000,0.33,"Second",1,{"$f":"IF(H19=\"Second\",(F19*G19*H20*1), IF(H19=\"Third\",(F19*G19*H20*1), (F19*G19*H20*I20)))","v":66},{"$f":" J21-J19","v":84},{"$f":"IF(F19>F21, \"Length Loss\", IF(F19<F21, \"Length Gain\", IF(F19=F21, \"No Change\")))","v":"No Change"},0.1,"Agricultural Easement","Easement",{"$f":"IF(D21=\"Restoration/Enhancement\",SUM(K19,L22,M21,N21),IF(D21=\"Preservation\",((0.1*J21)+M21+N21),\"NA\"))","v":98.4},"36.90897, -76.99859. Secondary channel of reach 1.  "]
[null,null,null,null,null,null,null,{"$f":"IF(H19=\"Primary\",1,IF(H19=\"Second\",0.2,IF(H19=\"Third\",0.1,IF(H19=\"Select\",0))))","v":0.2},{"$f":"IF(AND(B19=\"Piedmont\",I19>0.0001,I19<0.1),0.41, IF(AND(B19=\"Piedmont\",I19>10), 2.45, IF(B19=\"Piedmont\",I19^0.39, IF(AND(B19=\"Coastal Plain\",I19>0.0001,I19<0.1),0.42,IF(AND(B19=\"Coastal Plain\",I19>10),2.4, IF(B19=\"Coastal Plain\",I19^0.38, IF(AND(B19=\"Mountain\",I19>0.0001,I19<0.1),0.36,IF(AND(B19=\"Mountain\",I19>10),2.75,IF(B19=\"Mountain\",I19^0.44)))))))))","v":1},null,null,{"$f":"F21-F19","v":0},null,{"$f":"IF(AND(N19=\"No Existing Protection\",O19=\"Deed Restriction\"), 0.02, IF(AND(N19=\"No Existing Protection\",O19=\"Easement\"), 0.05, IF(AND(N19=\"No Existing Protection\", O19=\"Accredited Easement\"), 0.07, IF(AND(N19=\"No Existing Protection\", O19=\"Fee Simple to Conservation Holder\"), 0.09, IF(AND(N19=\"Agricultural Easement\",O19=\"Deed Restriction\"), 0.01, IF(AND(N19=\"Agricultural Easement\",O19=\"Easement\"), 0.04, IF(AND(N19=\"Agricultural Easement\", O19=\"Accredited Easement\"), 0.06, IF(AND(N19=\"Agricultural Easement\", O19=\"Fee Simple to Conservation Holder\"), 0.09, IF(AND(N19=\"Environmental Easement\",O19=\"Deed Restriction\"), 0, IF(AND(N19=\"Environmental Easement\", O19=\"Easement\"), 0.02, IF(AND(N19=\"Environmental Easement\", O19=\"Accredited Easement\"), 0.03, IF(AND(N19=\"Public Land\", O19=\"Public Land MOA\"), 0.02, 0))))))))))))","v":0.04}]
[null,{"$f":"B19","v":"Piedmont"},"Proposed","Restoration/Enhancement","Perennial Headwater",1000,0.75,{"$f":"H19","v":"Second"},{"$f":"I19","v":1},{"$f":"IF(H21=\"Second\",(F21*G21*H22*1), IF(H21=\"Third\",(F21*G21*H22*1), (F21*G21*H22*I22)))","v":150},null,0.5,{"$f":"IF(D21=\"Preservation\",((J21*0.1)*M19),(K19+L22)*M19)","v":8.4},{"$f":"IF(H19=\"Second\",(J21*N20),IF(H19=\"Third\",(J21*N20),(J21/I22*N20)))","v":6}]
[null,null,null,null,null,null,null,{"$f":"IF(H21=\"Primary\",1,IF(H21=\"Second\",0.2,IF(H21=\"Third\",0.1,IF(H21=\"Select\",0))))","v":0.2},{"$f":"IF(AND(B21=\"Piedmont\",I21>0.0001,I21<0.1),0.41, IF(AND(B21=\"Piedmont\",I21>10), 2.45, IF(B21=\"Piedmont\",I21^0.39, IF(AND(B21=\"Coastal Plain\",I21>0.0001,I21<0.1),0.42,IF(AND(B21=\"Coastal Plain\",I21>10),2.4, IF(B21=\"Coastal Plain\",I21^0.38, IF(AND(B21=\"Mountain\",I21>0.0001,I21<0.1),0.36,IF(AND(B21=\"Mountain\",I21>10),2.75,IF(B21=\"Mountain\",I21^0.44)))))))))","v":1},null,null,{"$f":"IF(AND(H19=\"Primary\",L19=\"Length Loss\"), L20*G19*I20*L21*-1,IF(AND(H19=\"Primary\", L19=\"Length Gain\"),L20*G21*I22*L21*-1,0))","v":0}]
[null,"Not Selected","Existing","Preliminary Resource Evaluation","Select",null,null,"Select",null,{"$f":"IF(H23=\"Second\",(F23*G23*H24*1), IF(H23=\"Third\",(F23*G23*H24*1), (F23*G23*H24*I24)))","v":0},{"$f":" J25-J23","v":0},{"$f":"IF(F23>F25, \"Length Loss\", IF(F23<F25, \"Length Gain\", IF(F23=F25, \"No Change\")))","v":"No Change"},0,"Existing: Select From Dropdown","Proposed: Select From Dropdown",{"$f":"IF(D25=\"Restoration/Enhancement\",SUM(K23,L26,M25,N25),IF(D25=\"Preservation\",((0.1*J25)+M25+N25),\"NA\"))","v":"NA"}]
[null,null,null,null,null,null,null,{"$f":"IF(H23=\"Primary\",1,IF(H23=\"Second\",0.2,IF(H23=\"Third\",0.1,IF(H23=\"Select\",0))))","v":0},{"$f":"IF(AND(B23=\"Piedmont\",I23>0.0001,I23<0.1),0.41, IF(AND(B23=\"Piedmont\",I23>10), 2.45, IF(B23=\"Piedmont\",I23^0.39, IF(AND(B23=\"Coastal Plain\",I23>0.0001,I23<0.1),0.42,IF(AND(B23=\"Coastal Plain\",I23>10),2.4, IF(B23=\"Coastal Plain\",I23^0.38, IF(AND(B23=\"Mountain\",I23>0.0001,I23<0.1),0.36,IF(AND(B23=\"Mountain\",I23>10),2.75,IF(B23=\"Mountain\",I23^0.44)))))))))","v":false},null,null,{"$f":"F25-F23","v":0},null,{"$f":"IF(AND(N23=\"No Existing Protection\",O23=\"Deed Restriction\"), 0.02, IF(AND(N23=\"No Existing Protection\",O23=\"Easement\"), 0.05, IF(AND(N23=\"No Existing Protection\", O23=\"Accredited Easement\"), 0.07, IF(AND(N23=\"No Existing Protection\", O23=\"Fee Simple to Conservation Holder\"), 0.09, IF(AND(N23=\"Agricultural Easement\",O23=\"Deed Restriction\"), 0.01, IF(AND(N23=\"Agricultural Easement\",O23=\"Easement\"), 0.04, IF(AND(N23=\"Agricultural Easement\", O23=\"Accredited Easement\"), 0.06, IF(AND(N23=\"Agricultural Easement\", O23=\"Fee Simple to Conservation Holder\"), 0.09, IF(AND(N23=\"Environmental Easement\",O23=\"Deed Restriction\"), 0, IF(AND(N23=\"Environmental Easement\", O23=\"Easement\"), 0.02, IF(AND(N23=\"Environmental Easement\", O23=\"Accredited Easement\"), 0.03, IF(AND(N23=\"Public Land\", O23=\"Public Land MOA\"), 0.02, 0))))))))))))","v":0}]
[null,{"$f":"B23","v":"Not Selected"},"Proposed","Select from Dropdown","Select",null,null,{"$f":"H23","v":"Select"},{"$f":"I23","v":0},{"$f":"IF(H25=\"Second\",(F25*G25*H26*1), IF(H25=\"Third\",(F25*G25*H26*1), (F25*G25*H26*I26)))","v":0},null,0.5,{"$f":"IF(D25=\"Preservation\",((J25*0.1)*M23),(K23+L26)*M23)","v":0},{"$f":"IF(H23=\"Second\",(J25*N24),IF(H23=\"Third\",(J25*N24),(J25/I26*N24)))","v":{"$error":"#DIV/0!"}}]
[null,null,null,null,null,null,null,{"$f":"IF(H25=\"Primary\",1,IF(H25=\"Second\",0.2,IF(H25=\"Third\",0.1,IF(H25=\"Select\",0))))","v":0},{"$f":"IF(AND(B25=\"Piedmont\",I25>0.0001,I25<0.1),0.41, IF(AND(B25=\"Piedmont\",I25>10), 2.45, IF(B25=\"Piedmont\",I25^0.39, IF(AND(B25=\"Coastal Plain\",I25>0.0001,I25<0.1),0.42,IF(AND(B25=\"Coastal Plain\",I25>10),2.4, IF(B25=\"Coastal Plain\",I25^0.38, IF(AND(B25=\"Mountain\",I25>0.0001,I25<0.1),0.36,IF(AND(B25=\"Mountain\",I25>10),2.75,IF(B25=\"Mountain\",I25^0.44)))))))))","v":false},null,null,{"$f":"IF(AND(H23=\"Primary\",L23=\"Length Loss\"), L24*G23*I24*L25*-1,IF(AND(H23=\"Primary\", L23=\"Length Gain\"),L24*G25*I26*L25*-1,0))","v":0}]
[null,"Not Selected","Existing","Preliminary Resource Evaluation","Select",null,null,"Select",null,{"$f":"IF(H27=\"Second\",(F27*G27*H28*1), IF(H27=\"Third\",(F27*G27*H28*1), (F27*G27*H28*I28)))","v":0},{"$f":" J29-J27","v":0},{"$f":"IF(F27>F29, \"Length Loss\", IF(F27<F29, \"Length Gain\", IF(F27=F29, \"No Change\")))","v":"No Change"},0,"Existing: Select From Dropdown","Proposed: Select From Dropdown",{"$f":"IF(D29=\"Restoration/Enhancement\",SUM(K27,L30,M29,N29),IF(D29=\"Preservation\",((0.1*J29)+M29+N29),\"NA\"))","v":"NA"}]
[null,null,null,null,null,null,null,{"$f":"IF(H27=\"Primary\",1,IF(H27=\"Second\",0.2,IF(H27=\"Third\",0.1,IF(H27=\"Select\",0))))","v":0},{"$f":"IF(AND(B27=\"Piedmont\",I27>0.0001,I27<0.1),0.41, IF(AND(B27=\"Piedmont\",I27>10), 2.45, IF(B27=\"Piedmont\",I27^0.39, IF(AND(B27=\"Coastal Plain\",I27>0.0001,I27<0.1),0.42,IF(AND(B27=\"Coastal Plain\",I27>10),2.4, IF(B27=\"Coastal Plain\",I27^0.38, IF(AND(B27=\"Mountain\",I27>0.0001,I27<0.1),0.36,IF(AND(B27=\"Mountain\",I27>10),2.75,IF(B27=\"Mountain\",I27^0.44)))))))))","v":false},null,null,{"$f":"F29-F27","v":0},null,{"$f":"IF(AND(N27=\"No Existing Protection\",O27=\"Deed Restriction\"), 0.02, IF(AND(N27=\"No Existing Protection\",O27=\"Easement\"), 0.05, IF(AND(N27=\"No Existing Protection\", O27=\"Accredited Easement\"), 0.07, IF(AND(N27=\"No Existing Protection\", O27=\"Fee Simple to Conservation Holder\"), 0.09, IF(AND(N27=\"Agricultural Easement\",O27=\"Deed Restriction\"), 0.01, IF(AND(N27=\"Agricultural Easement\",O27=\"Easement\"), 0.04, IF(AND(N27=\"Agricultural Easement\", O27=\"Accredited Easement\"), 0.06, IF(AND(N27=\"Agricultural Easement\", O27=\"Fee Simple to Conservation Holder\"), 0.09, IF(AND(N27=\"Environmental Easement\",O27=\"Deed Restriction\"), 0, IF(AND(N27=\"Environmental Easement\", O27=\"Easement\"), 0.02, IF(AND(N27=\"Environmental Easement\", O27=\"Accredited Easement\"), 0.03, IF(AND(N27=\"Public Land\", O27=\"Public Land MOA\"), 0.02, 0))))))))))))","v":0}]
[null,{"$f":"B27","v":"Not Selected"},"Proposed","Select from Dropdown","Select",null,null,{"$f":"H27","v":"Select"},0,{"$f":"IF(H29=\"Second\",(F29*G29*H30*1), IF(H29=\"Third\",(F29*G29*H30*1), (F29*G29*H30*I30)))","v":0},null,0.5,{"$f":"IF(D29=\"Preservation\",((J29*0.1)*M27),(K27+L30)*M27)","v":0},{"$f":"IF(H27=\"Second\",(J29*N28),IF(H27=\"Third\",(J29*N28),(J29/I30*N28)))","v":{"$error":"#DIV/0!"}}]
[null,null,null,null,null,null,null,{"$f":"IF(H29=\"Primary\",1,IF(H29=\"Second\",0.2,IF(H29=\"Third\",0.1,IF(H29=\"Select\",0))))","v":0},{"$f":"IF(AND(B29=\"Piedmont\",I29>0.0001,I29<0.1),0.41, IF(AND(B29=\"Piedmont\",I29>10), 2.45, IF(B29=\"Piedmont\",I29^0.39, IF(AND(B29=\"Coastal Plain\",I29>0.0001,I29<0.1),0.42,IF(AND(B29=\"Coastal Plain\",I29>10),2.4, IF(B29=\"Coastal Plain\",I29^0.38, IF(AND(B29=\"Mountain\",I29>0.0001,I29<0.1),0.36,IF(AND(B29=\"Mountain\",I29>10),2.75,IF(B29=\"Mountain\",I29^0.44)))))))))","v":false},null,null,{"$f":"IF(AND(H27=\"Primary\",L27=\"Length Loss\"), L28*G27*I28*L29*-1,IF(AND(H27=\"Primary\", L27=\"Length Gain\"),L28*G29*I30*L29*-1,0))","v":0}]
[null,"Not Selected","Existing","Preliminary Resource Evaluation","Select",null,null,"Select",null,{"$f":"IF(H31=\"Second\",(F31*G31*H32*1), IF(H31=\"Third\",(F31*G31*H32*1), (F31*G31*H32*I32)))","v":0},{"$f":" J33-J31","v":0},{"$f":"IF(F31>F33, \"Length Loss\", IF(F31<F33, \"Length Gain\", IF(F31=F33, \"No Change\")))","v":"No Change"},0,"Existing: Select From Dropdown","Proposed: Select From Dropdown",{"$f":"IF(D33=\"Restoration/Enhancement\",SUM(K31,L34,M33,N33),IF(D33=\"Preservation\",((0.1*J33)+M33+N33),\"NA\"))","v":"NA"}]
[null,null,null,null,null,null,null,{"$f":"IF(H31=\"Primary\",1,IF(H31=\"Second\",0.2,IF(H31=\"Third\",0.1,IF(H31=\"Select\",0))))","v":0},{"$f":"IF(AND(B31=\"Piedmont\",I31>0.0001,I31<0.1),0.41, IF(AND(B31=\"Piedmont\",I31>10), 2.45, IF(B31=\"Piedmont\",I31^0.39, IF(AND(B31=\"Coastal Plain\",I31>0.0001,I31<0.1),0.42,IF(AND(B31=\"Coastal Plain\",I31>10),2.4, IF(B31=\"Coastal Plain\",I31^0.38, IF(AND(B31=\"Mountain\",I31>0.0001,I31<0.1),0.36,IF(AND(B31=\"Mountain\",I31>10),2.75,IF(B31=\"Mountain\",I31^0.44)))))))))","v":false},null,null,{"$f":"F33-F31","v":0},null,{"$f":"IF(AND(N31=\"No Existing Protection\",O31=\"Deed Restriction\"), 0.02, IF(AND(N31=\"No Existing Protection\",O31=\"Easement\"), 0.05, IF(AND(N31=\"No Existing Protection\", O31=\"Accredited Easement\"), 0.07, IF(AND(N31=\"No Existing Protection\", O31=\"Fee Simple to Conservation Holder\"), 0.09, IF(AND(N31=\"Agricultural Easement\",O31=\"Deed Restriction\"), 0.01, IF(AND(N31=\"Agricultural Easement\",O31=\"Easement\"), 0.04, IF(AND(N31=\"Agricultural Easement\", O31=\"Accredited Easement\"), 0.06, IF(AND(N31=\"Agricultural Easement\", O31=\"Fee Simple to Conservation Holder\"), 0.09, IF(AND(N31=\"Environmental Easement\",O31=\"Deed Restriction\"), 0, IF(AND(N31=\"Environmental Easement\", O31=\"Easement\"), 0.02, IF(AND(N31=\"Environmental Easement\", O31=\"Accredited Easement\"), 0.03, IF(AND(N31=\"Public Land\", O31=\"Public Land MOA\"), 0.02, 0))))))))))))","v":0}]
[null,{"$f":"B31","v":"Not Selected"},"Proposed","Select from Dropdown","Select",null,null,{"$f":"H31","v":"Select"},0,{"$f":"IF(H33=\"Second\",(F33*G33*H34*1), IF(H33=\"Third\",(F33*G33*H34*1), (F33*G33*H34*I34)))","v":0},null,0.5,{"$f":"IF(D33=\"Preservation\",((J33*0.1)*M31),(K31+L34)*M31)","v":0},{"$f":"IF(H31=\"Second\",(J33*N32),IF(H31=\"Third\",(J33*N32),(J33/I34*N32)))","v":{"$error":"#DIV/0!"}}]
[null,null,null,null,null,null,null,{"$f":"IF(H33=\"Primary\",1,IF(H33=\"Second\",0.2,IF(H33=\"Third\",0.1,IF(H33=\"Select\",0))))","v":0},{"$f":"IF(AND(B33=\"Piedmont\",I33>0.0001,I33<0.1),0.41, IF(AND(B33=\"Piedmont\",I33>10), 2.45, IF(B33=\"Piedmont\",I33^0.39, IF(AND(B33=\"Coastal Plain\",I33>0.0001,I33<0.1),0.42,IF(AND(B33=\"Coastal Plain\",I33>10),2.4, IF(B33=\"Coastal Plain\",I33^0.38, IF(AND(B33=\"Mountain\",I33>0.0001,I33<0.1),0.36,IF(AND(B33=\"Mountain\",I33>10),2.75,IF(B33=\"Mountain\",I33^0.44)))))))))","v":false},null,null,{"$f":"IF(AND(H31=\"Primary\",L31=\"Length Loss\"), L32*G31*I32*L33*-1,IF(AND(H31=\"Primary\", L31=\"Length Gain\"),L32*G33*I34*L33*-1,0))","v":0}]
[null,"Not Selected","Existing","Preliminary Resource Evaluation","Select",null,null,"Select",null,{"$f":"IF(H35=\"Second\",(F35*G35*H36*1), IF(H35=\"Third\",(F35*G35*H36*1), (F35*G35*H36*I36)))","v":0},{"$f":" J37-J35","v":0},{"$f":"IF(F35>F37, \"Length Loss\", IF(F35<F37, \"Length Gain\", IF(F35=F37, \"No Change\")))","v":"No Change"},0,"Existing: Select From Dropdown","Proposed: Select From Dropdown",{"$f":"IF(D37=\"Restoration/Enhancement\",SUM(K35,L38,M37,N37),IF(D37=\"Preservation\",((0.1*J37)+M37+N37),\"NA\"))","v":"NA"}]
[null,null,null,null,null,null,null,{"$f":"IF(H35=\"Primary\",1,IF(H35=\"Second\",0.2,IF(H35=\"Third\",0.1,IF(H35=\"Select\",0))))","v":0},{"$f":"IF(AND(B35=\"Piedmont\",I35>0.0001,I35<0.1),0.41, IF(AND(B35=\"Piedmont\",I35>10), 2.45, IF(B35=\"Piedmont\",I35^0.39, IF(AND(B35=\"Coastal Plain\",I35>0.0001,I35<0.1),0.42,IF(AND(B35=\"Coastal Plain\",I35>10),2.4, IF(B35=\"Coastal Plain\",I35^0.38, IF(AND(B35=\"Mountain\",I35>0.0001,I35<0.1),0.36,IF(AND(B35=\"Mountain\",I35>10),2.75,IF(B35=\"Mountain\",I35^0.44)))))))))","v":false},null,null,{"$f":"F37-F35","v":0},null,{"$f":"IF(AND(N35=\"No Existing Protection\",O35=\"Deed Restriction\"), 0.02, IF(AND(N35=\"No Existing Protection\",O35=\"Easement\"), 0.05, IF(AND(N35=\"No Existing Protection\", O35=\"Accredited Easement\"), 0.07, IF(AND(N35=\"No Existing Protection\", O35=\"Fee Simple to Conservation Holder\"), 0.09, IF(AND(N35=\"Agricultural Easement\",O35=\"Deed Restriction\"), 0.01, IF(AND(N35=\"Agricultural Easement\",O35=\"Easement\"), 0.04, IF(AND(N35=\"Agricultural Easement\", O35=\"Accredited Easement\"), 0.06, IF(AND(N35=\"Agricultural Easement\", O35=\"Fee Simple to Conservation Holder\"), 0.09, IF(AND(N35=\"Environmental Easement\",O35=\"Deed Restriction\"), 0, IF(AND(N35=\"Environmental Easement\", O35=\"Easement\"), 0.02, IF(AND(N35=\"Environmental Easement\", O35=\"Accredited Easement\"), 0.03, IF(AND(N35=\"Public Land\", O35=\"Public Land MOA\"), 0.02, 0))))))))))))","v":0}]
[null,{"$f":"B35","v":"Not Selected"},"Proposed","Select from Dropdown","Select",null,null,{"$f":"H35","v":"Select"},0,{"$f":"IF(H37=\"Second\",(F37*G37*H38*1), IF(H37=\"Third\",(F37*G37*H38*1), (F37*G37*H38*I38)))","v":0},null,0.5,{"$f":"IF(D37=\"Preservation\",((J37*0.1)*M35),(K35+L38)*M35)","v":0},{"$f":"IF(H35=\"Second\",(J37*N36),IF(H35=\"Third\",(J37*N36),(J37/I38*N36)))","v":{"$error":"#DIV/0!"}}]
[null,null,null,null,null,null,null,{"$f":"IF(H37=\"Primary\",1,IF(H37=\"Second\",0.2,IF(H37=\"Third\",0.1,IF(H37=\"Select\",0))))","v":0},{"$f":"IF(AND(B37=\"Piedmont\",I37>0.0001,I37<0.1),0.41, IF(AND(B37=\"Piedmont\",I37>10), 2.45, IF(B37=\"Piedmont\",I37^0.39, IF(AND(B37=\"Coastal Plain\",I37>0.0001,I37<0.1),0.42,IF(AND(B37=\"Coastal Plain\",I37>10),2.4, IF(B37=\"Coastal Plain\",I37^0.38, IF(AND(B37=\"Mountain\",I37>0.0001,I37<0.1),0.36,IF(AND(B37=\"Mountain\",I37>10),2.75,IF(B37=\"Mountain\",I37^0.44)))))))))","v":false},null,null,{"$f":"IF(AND(H35=\"Primary\",L35=\"Length Loss\"), L36*G35*I36*L37*-1,IF(AND(H35=\"Primary\", L35=\"Length Gain\"),L36*G37*I38*L37*-1,0))","v":0}]
[null,"Not Selected","Existing","Preliminary Resource Evaluation","Select",null,null,"Select",null,{"$f":"IF(H39=\"Second\",(F39*G39*H40*1), IF(H39=\"Third\",(F39*G39*H40*1), (F39*G39*H40*I40)))","v":0},{"$f":" J41-J39","v":0},{"$f":"IF(F39>F41, \"Length Loss\", IF(F39<F41, \"Length Gain\", IF(F39=F41, \"No Change\")))","v":"No Change"},0,"Existing: Select From Dropdown","Proposed: Select From Dropdown",{"$f":"IF(D41=\"Restoration/Enhancement\",SUM(K39,L42,M41,N41),IF(D41=\"Preservation\",((0.1*J41)+M41+N41),\"NA\"))","v":"NA"}]
[null,null,null,null,null,null,null,{"$f":"IF(H39=\"Primary\",1,IF(H39=\"Second\",0.2,IF(H39=\"Third\",0.1,IF(H39=\"Select\",0))))","v":0},{"$f":"IF(AND(B39=\"Piedmont\",I39>0.0001,I39<0.1),0.41, IF(AND(B39=\"Piedmont\",I39>10), 2.45, IF(B39=\"Piedmont\",I39^0.39, IF(AND(B39=\"Coastal Plain\",I39>0.0001,I39<0.1),0.42,IF(AND(B39=\"Coastal Plain\",I39>10),2.4, IF(B39=\"Coastal Plain\",I39^0.38, IF(AND(B39=\"Mountain\",I39>0.0001,I39<0.1),0.36,IF(AND(B39=\"Mountain\",I39>10),2.75,IF(B39=\"Mountain\",I39^0.44)))))))))","v":false},null,null,{"$f":"F41-F39","v":0},null,{"$f":"IF(AND(N39=\"No Existing Protection\",O39=\"Deed Restriction\"), 0.02, IF(AND(N39=\"No Existing Protection\",O39=\"Easement\"), 0.05, IF(AND(N39=\"No Existing Protection\", O39=\"Accredited Easement\"), 0.07, IF(AND(N39=\"No Existing Protection\", O39=\"Fee Simple to Conservation Holder\"), 0.09, IF(AND(N39=\"Agricultural Easement\",O39=\"Deed Restriction\"), 0.01, IF(AND(N39=\"Agricultural Easement\",O39=\"Easement\"), 0.04, IF(AND(N39=\"Agricultural Easement\", O39=\"Accredited Easement\"), 0.06, IF(AND(N39=\"Agricultural Easement\", O39=\"Fee Simple to Conservation Holder\"), 0.09, IF(AND(N39=\"Environmental Easement\",O39=\"Deed Restriction\"), 0, IF(AND(N39=\"Environmental Easement\", O39=\"Easement\"), 0.02, IF(AND(N39=\"Environmental Easement\", O39=\"Accredited Easement\"), 0.03, IF(AND(N39=\"Public Land\", O39=\"Public Land MOA\"), 0.02, 0))))))))))))","v":0}]
[null,{"$f":"B39","v":"Not Selected"},"Proposed","Select from Dropdown","Select",null,null,{"$f":"H39","v":"Select"},0,{"$f":"IF(H41=\"Second\",(F41*G41*H42*1), IF(H41=\"Third\",(F41*G41*H42*1), (F41*G41*H42*I42)))","v":0},null,0.5,{"$f":"IF(D41=\"Preservation\",((J41*0.1)*M39),(K39+L42)*M39)","v":0},{"$f":"IF(H39=\"Second\",(J41*N40),IF(H39=\"Third\",(J41*N40),(J41/I42*N40)))","v":{"$error":"#DIV/0!"}}]
[null,null,null,null,null,null,null,{"$f":"IF(H41=\"Primary\",1,IF(H41=\"Second\",0.2,IF(H41=\"Third\",0.1,IF(H41=\"Select\",0))))","v":0},{"$f":"IF(AND(B41=\"Piedmont\",I41>0.0001,I41<0.1),0.41, IF(AND(B41=\"Piedmont\",I41>10), 2.45, IF(B41=\"Piedmont\",I41^0.39, IF(AND(B41=\"Coastal Plain\",I41>0.0001,I41<0.1),0.42,IF(AND(B41=\"Coastal Plain\",I41>10),2.4, IF(B41=\"Coastal Plain\",I41^0.38, IF(AND(B41=\"Mountain\",I41>0.0001,I41<0.1),0.36,IF(AND(B41=\"Mountain\",I41>10),2.75,IF(B41=\"Mountain\",I41^0.44)))))))))","v":false},null,null,{"$f":"IF(AND(H39=\"Primary\",L39=\"Length Loss\"), L40*G39*I40*L41*-1,IF(AND(H39=\"Primary\", L39=\"Length Gain\"),L40*G41*I42*L41*-1,0))","v":0}]
[null,"Not Selected","Existing","Preliminary Resource Evaluation","Select",null,null,"Select",null,{"$f":"IF(H43=\"Second\",(F43*G43*H44*1), IF(H43=\"Third\",(F43*G43*H44*1), (F43*G43*H44*I44)))","v":0},{"$f":" J45-J43","v":0},{"$f":"IF(F43>F45, \"Length Loss\", IF(F43<F45, \"Length Gain\", IF(F43=F45, \"No Change\")))","v":"No Change"},0,"Existing: Select From Dropdown","Proposed: Select From Dropdown",{"$f":"IF(D45=\"Restoration/Enhancement\",SUM(K43,L46,M45,N45),IF(D45=\"Preservation\",((0.1*J45)+M45+N45),\"NA\"))","v":"NA"}]
[null,null,null,null,null,null,null,{"$f":"IF(H43=\"Primary\",1,IF(H43=\"Second\",0.2,IF(H43=\"Third\",0.1,IF(H43=\"Select\",0))))","v":0},{"$f":"IF(AND(B43=\"Piedmont\",I43>0.0001,I43<0.1),0.41, IF(AND(B43=\"Piedmont\",I43>10), 2.45, IF(B43=\"Piedmont\",I43^0.39, IF(AND(B43=\"Coastal Plain\",I43>0.0001,I43<0.1),0.42,IF(AND(B43=\"Coastal Plain\",I43>10),2.4, IF(B43=\"Coastal Plain\",I43^0.38, IF(AND(B43=\"Mountain\",I43>0.0001,I43<0.1),0.36,IF(AND(B43=\"Mountain\",I43>10),2.75,IF(B43=\"Mountain\",I43^0.44)))))))))","v":false},null,null,{"$f":"F45-F43","v":0},null,{"$f":"IF(AND(N43=\"No Existing Protection\",O43=\"Deed Restriction\"), 0.02, IF(AND(N43=\"No Existing Protection\",O43=\"Easement\"), 0.05, IF(AND(N43=\"No Existing Protection\", O43=\"Accredited Easement\"), 0.07, IF(AND(N43=\"No Existing Protection\", O43=\"Fee Simple to Conservation Holder\"), 0.09, IF(AND(N43=\"Agricultural Easement\",O43=\"Deed Restriction\"), 0.01, IF(AND(N43=\"Agricultural Easement\",O43=\"Easement\"), 0.04, IF(AND(N43=\"Agricultural Easement\", O43=\"Accredited Easement\"), 0.06, IF(AND(N43=\"Agricultural Easement\", O43=\"Fee Simple to Conservation Holder\"), 0.09, IF(AND(N43=\"Environmental Easement\",O43=\"Deed Restriction\"), 0, IF(AND(N43=\"Environmental Easement\", O43=\"Easement\"), 0.02, IF(AND(N43=\"Environmental Easement\", O43=\"Accredited Easement\"), 0.03, IF(AND(N43=\"Public Land\", O43=\"Public Land MOA\"), 0.02, 0))))))))))))","v":0}]
[null,{"$f":"B43","v":"Not Selected"},"Proposed","Select from Dropdown","Select",null,null,{"$f":"H43","v":"Select"},0,{"$f":"IF(H45=\"Second\",(F45*G45*H46*1), IF(H45=\"Third\",(F45*G45*H46*1), (F45*G45*H46*I46)))","v":0},null,0.5,{"$f":"IF(D45=\"Preservation\",((J45*0.1)*M43),(K43+L46)*M43)","v":0},{"$f":"IF(H43=\"Second\",(J45*N44),IF(H43=\"Third\",(J45*N44),(J45/I46*N44)))","v":{"$error":"#DIV/0!"}}]
[null,null,null,null,null,null,null,{"$f":"IF(H45=\"Primary\",1,IF(H45=\"Second\",0.2,IF(H45=\"Third\",0.1,IF(H45=\"Select\",0))))","v":0},{"$f":"IF(AND(B45=\"Piedmont\",I45>0.0001,I45<0.1),0.41, IF(AND(B45=\"Piedmont\",I45>10), 2.45, IF(B45=\"Piedmont\",I45^0.39, IF(AND(B45=\"Coastal Plain\",I45>0.0001,I45<0.1),0.42,IF(AND(B45=\"Coastal Plain\",I45>10),2.4, IF(B45=\"Coastal Plain\",I45^0.38, IF(AND(B45=\"Mountain\",I45>0.0001,I45<0.1),0.36,IF(AND(B45=\"Mountain\",I45>10),2.75,IF(B45=\"Mountain\",I45^0.44)))))))))","v":false},null,null,{"$f":"IF(AND(H43=\"Primary\",L43=\"Length Loss\"), L44*G43*I44*L45*-1,IF(AND(H43=\"Primary\", L43=\"Length Gain\"),L44*G45*I46*L45*-1,0))","v":0}]
[null,"Not Selected","Existing","Preliminary Resource Evaluation","Select",null,null,"Select",null,{"$f":"IF(H47=\"Second\",(F47*G47*H48*1), IF(H47=\"Third\",(F47*G47*H48*1), (F47*G47*H48*I48)))","v":0},{"$f":" J49-J47","v":0},{"$f":"IF(F47>F49, \"Length Loss\", IF(F47<F49, \"Length Gain\", IF(F47=F49, \"No Change\")))","v":"No Change"},0,"Existing: Select From Dropdown","Proposed: Select From Dropdown",{"$f":"IF(D49=\"Restoration/Enhancement\",SUM(K47,L50,M49,N49),IF(D49=\"Preservation\",((0.1*J49)+M49+N49),\"NA\"))","v":"NA"}]
[null,null,null,null,null,null,null,{"$f":"IF(H47=\"Primary\",1,IF(H47=\"Second\",0.2,IF(H47=\"Third\",0.1,IF(H47=\"Select\",0))))","v":0},{"$f":"IF(AND(B47=\"Piedmont\",I47>0.0001,I47<0.1),0.41, IF(AND(B47=\"Piedmont\",I47>10), 2.45, IF(B47=\"Piedmont\",I47^0.39, IF(AND(B47=\"Coastal Plain\",I47>0.0001,I47<0.1),0.42,IF(AND(B47=\"Coastal Plain\",I47>10),2.4, IF(B47=\"Coastal Plain\",I47^0.38, IF(AND(B47=\"Mountain\",I47>0.0001,I47<0.1),0.36,IF(AND(B47=\"Mountain\",I47>10),2.75,IF(B47=\"Mountain\",I47^0.44)))))))))","v":false},null,null,{"$f":"F49-F47","v":0},null,{"$f":"IF(AND(N47=\"No Existing Protection\",O47=\"Deed Restriction\"), 0.02, IF(AND(N47=\"No Existing Protection\",O47=\"Easement\"), 0.05, IF(AND(N47=\"No Existing Protection\", O47=\"Accredited Easement\"), 0.07, IF(AND(N47=\"No Existing Protection\", O47=\"Fee Simple to Conservation Holder\"), 0.09, IF(AND(N47=\"Agricultural Easement\",O47=\"Deed Restriction\"), 0.01, IF(AND(N47=\"Agricultural Easement\",O47=\"Easement\"), 0.04, IF(AND(N47=\"Agricultural Easement\", O47=\"Accredited Easement\"), 0.06, IF(AND(N47=\"Agricultural Easement\", O47=\"Fee Simple to Conservation Holder\"), 0.09, IF(AND(N47=\"Environmental Easement\",O47=\"Deed Restriction\"), 0, IF(AND(N47=\"Environmental Easement\", O47=\"Easement\"), 0.02, IF(AND(N47=\"Environmental Easement\", O47=\"Accredited Easement\"), 0.03, IF(AND(N47=\"Public Land\", O47=\"Public Land MOA\"), 0.02, 0))))))))))))","v":0}]
[null,{"$f":"B47","v":"Not Selected"},"Proposed","Select from Dropdown","Select",null,null,{"$f":"H47","v":"Select"},0,{"$f":"IF(H49=\"Second\",(F49*G49*H50*1), IF(H49=\"Third\",(F49*G49*H50*1), (F49*G49*H50*I50)))","v":0},null,0.5,{"$f":"IF(D49=\"Preservation\",((J49*0.1)*M47),(K47+L50)*M47)","v":0},{"$f":"IF(H47=\"Second\",(J49*N48),IF(H47=\"Third\",(J49*N48),(J49/I50*N48)))","v":{"$error":"#DIV/0!"}}]
[null,null,null,null,null,null,null,{"$f":"IF(H49=\"Primary\",1,IF(H49=\"Second\",0.2,IF(H49=\"Third\",0.1,IF(H49=\"Select\",0))))","v":0},{"$f":"IF(AND(B49=\"Piedmont\",I49>0.0001,I49<0.1),0.41, IF(AND(B49=\"Piedmont\",I49>10), 2.45, IF(B49=\"Piedmont\",I49^0.39, IF(AND(B49=\"Coastal Plain\",I49>0.0001,I49<0.1),0.42,IF(AND(B49=\"Coastal Plain\",I49>10),2.4, IF(B49=\"Coastal Plain\",I49^0.38, IF(AND(B49=\"Mountain\",I49>0.0001,I49<0.1),0.36,IF(AND(B49=\"Mountain\",I49>10),2.75,IF(B49=\"Mountain\",I49^0.44)))))))))","v":false},null,null,{"$f":"IF(AND(H47=\"Primary\",L47=\"Length Loss\"), L48*G47*I48*L49*-1,IF(AND(H47=\"Primary\", L47=\"Length Gain\"),L48*G49*I50*L49*-1,0))","v":0}]
[null,"Not Selected","Existing","Preliminary Resource Evaluation","Select",null,null,"Select",null,{"$f":"IF(H51=\"Second\",(F51*G51*H52*1), IF(H51=\"Third\",(F51*G51*H52*1), (F51*G51*H52*I52)))","v":0},{"$f":" J53-J51","v":0},{"$f":"IF(F51>F53, \"Length Loss\", IF(F51<F53, \"Length Gain\", IF(F51=F53, \"No Change\")))","v":"No Change"},0,"Existing: Select From Dropdown","Proposed: Select From Dropdown",{"$f":"IF(D53=\"Restoration/Enhancement\",SUM(K51,L54,M53,N53),IF(D53=\"Preservation\",((0.1*J53)+M53+N53),\"NA\"))","v":"NA"}]
[null,null,null,null,null,null,null,{"$f":"IF(H51=\"Primary\",1,IF(H51=\"Second\",0.2,IF(H51=\"Third\",0.1,IF(H51=\"Select\",0))))","v":0},{"$f":"IF(AND(B51=\"Piedmont\",I51>0.0001,I51<0.1),0.41, IF(AND(B51=\"Piedmont\",I51>10), 2.45, IF(B51=\"Piedmont\",I51^0.39, IF(AND(B51=\"Coastal Plain\",I51>0.0001,I51<0.1),0.42,IF(AND(B51=\"Coastal Plain\",I51>10),2.4, IF(B51=\"Coastal Plain\",I51^0.38, IF(AND(B51=\"Mountain\",I51>0.0001,I51<0.1),0.36,IF(AND(B51=\"Mountain\",I51>10),2.75,IF(B51=\"Mountain\",I51^0.44)))))))))","v":false},null,null,{"$f":"F53-F51","v":0},null,{"$f":"IF(AND(N51=\"No Existing Protection\",O51=\"Deed Restriction\"), 0.02, IF(AND(N51=\"No Existing Protection\",O51=\"Easement\"), 0.05, IF(AND(N51=\"No Existing Protection\", O51=\"Accredited Easement\"), 0.07, IF(AND(N51=\"No Existing Protection\", O51=\"Fee Simple to Conservation Holder\"), 0.09, IF(AND(N51=\"Agricultural Easement\",O51=\"Deed Restriction\"), 0.01, IF(AND(N51=\"Agricultural Easement\",O51=\"Easement\"), 0.04, IF(AND(N51=\"Agricultural Easement\", O51=\"Accredited Easement\"), 0.06, IF(AND(N51=\"Agricultural Easement\", O51=\"Fee Simple to Conservation Holder\"), 0.09, IF(AND(N51=\"Environmental Easement\",O51=\"Deed Restriction\"), 0, IF(AND(N51=\"Environmental Easement\", O51=\"Easement\"), 0.02, IF(AND(N51=\"Environmental Easement\", O51=\"Accredited Easement\"), 0.03, IF(AND(N51=\"Public Land\", O51=\"Public Land MOA\"), 0.02, 0))))))))))))","v":0}]
[null,{"$f":"B51","v":"Not Selected"},"Proposed","Select from Dropdown","Select",null,null,{"$f":"H51","v":"Select"},0,{"$f":"IF(H53=\"Second\",(F53*G53*H54*1), IF(H53=\"Third\",(F53*G53*H54*1), (F53*G53*H54*I54)))","v":0},null,0.5,{"$f":"IF(D53=\"Preservation\",((J53*0.1)*M51),(K51+L54)*M51)","v":0},{"$f":"IF(H51=\"Second\",(J53*N52),IF(H51=\"Third\",(J53*N52),(J53/I54*N52)))","v":{"$error":"#DIV/0!"}}]
[null,null,null,null,null,null,null,{"$f":"IF(H53=\"Primary\",1,IF(H53=\"Second\",0.2,IF(H53=\"Third\",0.1,IF(H53=\"Select\",0))))","v":0},{"$f":"IF(AND(B53=\"Piedmont\",I53>0.0001,I53<0.1),0.41, IF(AND(B53=\"Piedmont\",I53>10), 2.45, IF(B53=\"Piedmont\",I53^0.39, IF(AND(B53=\"Coastal Plain\",I53>0.0001,I53<0.1),0.42,IF(AND(B53=\"Coastal Plain\",I53>10),2.4, IF(B53=\"Coastal Plain\",I53^0.38, IF(AND(B53=\"Mountain\",I53>0.0001,I53<0.1),0.36,IF(AND(B53=\"Mountain\",I53>10),2.75,IF(B53=\"Mountain\",I53^0.44)))))))))","v":false},null,null,{"$f":"IF(AND(H51=\"Primary\",L51=\"Length Loss\"), L52*G51*I52*L53*-1,IF(AND(H51=\"Primary\", L51=\"Length Gain\"),L52*G53*I54*L53*-1,0))","v":0}]
[null,"Not Selected","Existing","Preliminary Resource Evaluation","Select",null,null,"Select",null,{"$f":"IF(H55=\"Second\",(F55*G55*H56*1), IF(H55=\"Third\",(F55*G55*H56*1), (F55*G55*H56*I56)))","v":0},{"$f":" J57-J55","v":0},{"$f":"IF(F55>F57, \"Length Loss\", IF(F55<F57, \"Length Gain\", IF(F55=F57, \"No Change\")))","v":"No Change"},0,"Existing: Select From Dropdown","Proposed: Select From Dropdown",{"$f":"IF(D57=\"Restoration/Enhancement\",SUM(K55,L58,M57,N57),IF(D57=\"Preservation\",((0.1*J57)+M57+N57),\"NA\"))","v":"NA"}]
[null,null,null,null,null,null,null,{"$f":"IF(H55=\"Primary\",1,IF(H55=\"Second\",0.2,IF(H55=\"Third\",0.1,IF(H55=\"Select\",0))))","v":0},{"$f":"IF(AND(B55=\"Piedmont\",I55>0.0001,I55<0.1),0.41, IF(AND(B55=\"Piedmont\",I55>10), 2.45, IF(B55=\"Piedmont\",I55^0.39, IF(AND(B55=\"Coastal Plain\",I55>0.0001,I55<0.1),0.42,IF(AND(B55=\"Coastal Plain\",I55>10),2.4, IF(B55=\"Coastal Plain\",I55^0.38, IF(AND(B55=\"Mountain\",I55>0.0001,I55<0.1),0.36,IF(AND(B55=\"Mountain\",I55>10),2.75,IF(B55=\"Mountain\",I55^0.44)))))))))","v":false},null,null,{"$f":"F57-F55","v":0},null,{"$f":"IF(AND(N55=\"No Existing Protection\",O55=\"Deed Restriction\"), 0.02, IF(AND(N55=\"No Existing Protection\",O55=\"Easement\"), 0.05, IF(AND(N55=\"No Existing Protection\", O55=\"Accredited Easement\"), 0.07, IF(AND(N55=\"No Existing Protection\", O55=\"Fee Simple to Conservation Holder\"), 0.09, IF(AND(N55=\"Agricultural Easement\",O55=\"Deed Restriction\"), 0.01, IF(AND(N55=\"Agricultural Easement\",O55=\"Easement\"), 0.04, IF(AND(N55=\"Agricultural Easement\", O55=\"Accredited Easement\"), 0.06, IF(AND(N55=\"Agricultural Easement\", O55=\"Fee Simple to Conservation Holder\"), 0.09, IF(AND(N55=\"Environmental Easement\",O55=\"Deed Restriction\"), 0, IF(AND(N55=\"Environmental Easement\", O55=\"Easement\"), 0.02, IF(AND(N55=\"Environmental Easement\", O55=\"Accredited Easement\"), 0.03, IF(AND(N55=\"Public Land\", O55=\"Public Land MOA\"), 0.02, 0))))))))))))","v":0}]
[null,{"$f":"B55","v":"Not Selected"},"Proposed","Select from Dropdown","Select",null,null,{"$f":"H55","v":"Select"},0,{"$f":"IF(H57=\"Second\",(F57*G57*H58*1), IF(H57=\"Third\",(F57*G57*H58*1), (F57*G57*H58*I58)))","v":0},null,0.5,{"$f":"IF(D57=\"Preservation\",((J57*0.1)*M55),(K55+L58)*M55)","v":0},{"$f":"IF(H55=\"Second\",(J57*N56),IF(H55=\"Third\",(J57*N56),(J57/I58*N56)))","v":{"$error":"#DIV/0!"}}]
[null,null,null,null,null,null,null,{"$f":"IF(H57=\"Primary\",1,IF(H57=\"Second\",0.2,IF(H57=\"Third\",0.1,IF(H57=\"Select\",0))))","v":0},{"$f":"IF(AND(B57=\"Piedmont\",I57>0.0001,I57<0.1),0.41, IF(AND(B57=\"Piedmont\",I57>10), 2.45, IF(B57=\"Piedmont\",I57^0.39, IF(AND(B57=\"Coastal Plain\",I57>0.0001,I57<0.1),0.42,IF(AND(B57=\"Coastal Plain\",I57>10),2.4, IF(B57=\"Coastal Plain\",I57^0.38, IF(AND(B57=\"Mountain\",I57>0.0001,I57<0.1),0.36,IF(AND(B57=\"Mountain\",I57>10),2.75,IF(B57=\"Mountain\",I57^0.44)))))))))","v":false},null,null,{"$f":"IF(AND(H55=\"Primary\",L55=\"Length Loss\"), L56*G55*I56*L57*-1,IF(AND(H55=\"Primary\", L55=\"Length Gain\"),L56*G57*I58*L57*-1,0))","v":0}]
[null,"Not Selected","Existing","Preliminary Resource Evaluation","Select",null,null,"Select",null,{"$f":"IF(H59=\"Second\",(F59*G59*H60*1), IF(H59=\"Third\",(F59*G59*H60*1), (F59*G59*H60*I60)))","v":0},{"$f":" J61-J59","v":0},{"$f":"IF(F59>F61, \"Length Loss\", IF(F59<F61, \"Length Gain\", IF(F59=F61, \"No Change\")))","v":"No Change"},0,"Existing: Select From Dropdown","Proposed: Select From Dropdown",{"$f":"IF(D61=\"Restoration/Enhancement\",SUM(K59,L62,M61,N61),IF(D61=\"Preservation\",((0.1*J61)+M61+N61),\"NA\"))","v":"NA"}]
[null,null,null,null,null,null,null,{"$f":"IF(H59=\"Primary\",1,IF(H59=\"Second\",0.2,IF(H59=\"Third\",0.1,IF(H59=\"Select\",0))))","v":0},{"$f":"IF(AND(B59=\"Piedmont\",I59>0.0001,I59<0.1),0.41, IF(AND(B59=\"Piedmont\",I59>10), 2.45, IF(B59=\"Piedmont\",I59^0.39, IF(AND(B59=\"Coastal Plain\",I59>0.0001,I59<0.1),0.42,IF(AND(B59=\"Coastal Plain\",I59>10),2.4, IF(B59=\"Coastal Plain\",I59^0.38, IF(AND(B59=\"Mountain\",I59>0.0001,I59<0.1),0.36,IF(AND(B59=\"Mountain\",I59>10),2.75,IF(B59=\"Mountain\",I59^0.44)))))))))","v":false},null,null,{"$f":"F61-F59","v":0},null,{"$f":"IF(AND(N59=\"No Existing Protection\",O59=\"Deed Restriction\"), 0.02, IF(AND(N59=\"No Existing Protection\",O59=\"Easement\"), 0.05, IF(AND(N59=\"No Existing Protection\", O59=\"Accredited Easement\"), 0.07, IF(AND(N59=\"No Existing Protection\", O59=\"Fee Simple to Conservation Holder\"), 0.09, IF(AND(N59=\"Agricultural Easement\",O59=\"Deed Restriction\"), 0.01, IF(AND(N59=\"Agricultural Easement\",O59=\"Easement\"), 0.04, IF(AND(N59=\"Agricultural Easement\", O59=\"Accredited Easement\"), 0.06, IF(AND(N59=\"Agricultural Easement\", O59=\"Fee Simple to Conservation Holder\"), 0.09, IF(AND(N59=\"Environmental Easement\",O59=\"Deed Restriction\"), 0, IF(AND(N59=\"Environmental Easement\", O59=\"Easement\"), 0.02, IF(AND(N59=\"Environmental Easement\", O59=\"Accredited Easement\"), 0.03, IF(AND(N59=\"Public Land\", O59=\"Public Land MOA\"), 0.02, 0))))))))))))","v":0}]
[null,{"$f":"B59","v":"Not Selected"},"Proposed","Select from Dropdown","Select",null,null,{"$f":"H59","v":"Select"},0,{"$f":"IF(H61=\"Second\",(F61*G61*H62*1), IF(H61=\"Third\",(F61*G61*H62*1), (F61*G61*H62*I62)))","v":0},null,0.5,{"$f":"IF(D61=\"Preservation\",((J61*0.1)*M59),(K59+L62)*M59)","v":0},{"$f":"IF(H59=\"Second\",(J61*N60),IF(H59=\"Third\",(J61*N60),(J61/I62*N60)))","v":{"$error":"#DIV/0!"}}]
[null,null,null,null,null,null,null,{"$f":"IF(H61=\"Primary\",1,IF(H61=\"Second\",0.2,IF(H61=\"Third\",0.1,IF(H61=\"Select\",0))))","v":0},{"$f":"IF(AND(B61=\"Piedmont\",I61>0.0001,I61<0.1),0.41, IF(AND(B61=\"Piedmont\",I61>10), 2.45, IF(B61=\"Piedmont\",I61^0.39, IF(AND(B61=\"Coastal Plain\",I61>0.0001,I61<0.1),0.42,IF(AND(B61=\"Coastal Plain\",I61>10),2.4, IF(B61=\"Coastal Plain\",I61^0.38, IF(AND(B61=\"Mountain\",I61>0.0001,I61<0.1),0.36,IF(AND(B61=\"Mountain\",I61>10),2.75,IF(B61=\"Mountain\",I61^0.44)))))))))","v":false},null,null,{"$f":"IF(AND(H59=\"Primary\",L59=\"Length Loss\"), L60*G59*I60*L61*-1,IF(AND(H59=\"Primary\", L59=\"Length Gain\"),L60*G61*I62*L61*-1,0))","v":0}]
[null,"Not Selected","Existing","Preliminary Resource Evaluation","Select",null,null,"Select",null,{"$f":"IF(H63=\"Second\",(F63*G63*H64*1), IF(H63=\"Third\",(F63*G63*H64*1), (F63*G63*H64*I64)))","v":0},{"$f":" J65-J63","v":0},{"$f":"IF(F63>F65, \"Length Loss\", IF(F63<F65, \"Length Gain\", IF(F63=F65, \"No Change\")))","v":"No Change"},0,"Existing: Select From Dropdown","Proposed: Select From Dropdown",{"$f":"IF(D65=\"Restoration/Enhancement\",SUM(K63,L66,M65,N65),IF(D65=\"Preservation\",((0.1*J65)+M65+N65),\"NA\"))","v":"NA"}]
[null,null,null,null,null,null,null,{"$f":"IF(H63=\"Primary\",1,IF(H63=\"Second\",0.2,IF(H63=\"Third\",0.1,IF(H63=\"Select\",0))))","v":0},{"$f":"IF(AND(B63=\"Piedmont\",I63>0.0001,I63<0.1),0.41, IF(AND(B63=\"Piedmont\",I63>10), 2.45, IF(B63=\"Piedmont\",I63^0.39, IF(AND(B63=\"Coastal Plain\",I63>0.0001,I63<0.1),0.42,IF(AND(B63=\"Coastal Plain\",I63>10),2.4, IF(B63=\"Coastal Plain\",I63^0.38, IF(AND(B63=\"Mountain\",I63>0.0001,I63<0.1),0.36,IF(AND(B63=\"Mountain\",I63>10),2.75,IF(B63=\"Mountain\",I63^0.44)))))))))","v":false},null,null,{"$f":"F65-F63","v":0},null,{"$f":"IF(AND(N63=\"No Existing Protection\",O63=\"Deed Restriction\"), 0.02, IF(AND(N63=\"No Existing Protection\",O63=\"Easement\"), 0.05, IF(AND(N63=\"No Existing Protection\", O63=\"Accredited Easement\"), 0.07, IF(AND(N63=\"No Existing Protection\", O63=\"Fee Simple to Conservation Holder\"), 0.09, IF(AND(N63=\"Agricultural Easement\",O63=\"Deed Restriction\"), 0.01, IF(AND(N63=\"Agricultural Easement\",O63=\"Easement\"), 0.04, IF(AND(N63=\"Agricultural Easement\", O63=\"Accredited Easement\"), 0.06, IF(AND(N63=\"Agricultural Easement\", O63=\"Fee Simple to Conservation Holder\"), 0.09, IF(AND(N63=\"Environmental Easement\",O63=\"Deed Restriction\"), 0, IF(AND(N63=\"Environmental Easement\", O63=\"Easement\"), 0.02, IF(AND(N63=\"Environmental Easement\", O63=\"Accredited Easement\"), 0.03, IF(AND(N63=\"Public Land\", O63=\"Public Land MOA\"), 0.02, 0))))))))))))","v":0}]
[null,{"$f":"B63","v":"Not Selected"},"Proposed","Select from Dropdown","Select",null,null,{"$f":"H63","v":"Select"},0,{"$f":"IF(H65=\"Second\",(F65*G65*H66*1), IF(H65=\"Third\",(F65*G65*H66*1), (F65*G65*H66*I66)))","v":0},null,0.5,{"$f":"IF(D65=\"Preservation\",((J65*0.1)*M63),(K63+L66)*M63)","v":0},{"$f":"IF(H63=\"Second\",(J65*N64),IF(H63=\"Third\",(J65*N64),(J65/I66*N64)))","v":{"$error":"#DIV/0!"}}]
[null,null,null,null,null,null,null,{"$f":"IF(H65=\"Primary\",1,IF(H65=\"Second\",0.2,IF(H65=\"Third\",0.1,IF(H65=\"Select\",0))))","v":0},{"$f":"IF(AND(B65=\"Piedmont\",I65>0.0001,I65<0.1),0.41, IF(AND(B65=\"Piedmont\",I65>10), 2.45, IF(B65=\"Piedmont\",I65^0.39, IF(AND(B65=\"Coastal Plain\",I65>0.0001,I65<0.1),0.42,IF(AND(B65=\"Coastal Plain\",I65>10),2.4, IF(B65=\"Coastal Plain\",I65^0.38, IF(AND(B65=\"Mountain\",I65>0.0001,I65<0.1),0.36,IF(AND(B65=\"Mountain\",I65>10),2.75,IF(B65=\"Mountain\",I65^0.44)))))))))","v":false},null,null,{"$f":"IF(AND(H63=\"Primary\",L63=\"Length Loss\"), L64*G63*I64*L65*-1,IF(AND(H63=\"Primary\", L63=\"Length Gain\"),L64*G65*I66*L65*-1,0))","v":0}]
[null,"Not Selected","Existing","Preliminary Resource Evaluation","Select",null,null,"Select",null,{"$f":"IF(H67=\"Second\",(F67*G67*H68*1), IF(H67=\"Third\",(F67*G67*H68*1), (F67*G67*H68*I68)))","v":0},{"$f":" J69-J67","v":0},{"$f":"IF(F67>F69, \"Length Loss\", IF(F67<F69, \"Length Gain\", IF(F67=F69, \"No Change\")))","v":"No Change"},0,"Existing: Select From Dropdown","Proposed: Select From Dropdown",{"$f":"IF(D69=\"Restoration/Enhancement\",SUM(K67,L70,M69,N69),IF(D69=\"Preservation\",((0.1*J69)+M69+N69),\"NA\"))","v":"NA"}]
[null,null,null,null,null,null,null,{"$f":"IF(H67=\"Primary\",1,IF(H67=\"Second\",0.2,IF(H67=\"Third\",0.1,IF(H67=\"Select\",0))))","v":0},{"$f":"IF(AND(B67=\"Piedmont\",I67>0.0001,I67<0.1),0.41, IF(AND(B67=\"Piedmont\",I67>10), 2.45, IF(B67=\"Piedmont\",I67^0.39, IF(AND(B67=\"Coastal Plain\",I67>0.0001,I67<0.1),0.42,IF(AND(B67=\"Coastal Plain\",I67>10),2.4, IF(B67=\"Coastal Plain\",I67^0.38, IF(AND(B67=\"Mountain\",I67>0.0001,I67<0.1),0.36,IF(AND(B67=\"Mountain\",I67>10),2.75,IF(B67=\"Mountain\",I67^0.44)))))))))","v":false},null,null,{"$f":"F69-F67","v":0},null,{"$f":"IF(AND(N67=\"No Existing Protection\",O67=\"Deed Restriction\"), 0.02, IF(AND(N67=\"No Existing Protection\",O67=\"Easement\"), 0.05, IF(AND(N67=\"No Existing Protection\", O67=\"Accredited Easement\"), 0.07, IF(AND(N67=\"No Existing Protection\", O67=\"Fee Simple to Conservation Holder\"), 0.09, IF(AND(N67=\"Agricultural Easement\",O67=\"Deed Restriction\"), 0.01, IF(AND(N67=\"Agricultural Easement\",O67=\"Easement\"), 0.04, IF(AND(N67=\"Agricultural Easement\", O67=\"Accredited Easement\"), 0.06, IF(AND(N67=\"Agricultural Easement\", O67=\"Fee Simple to Conservation Holder\"), 0.09, IF(AND(N67=\"Environmental Easement\",O67=\"Deed Restriction\"), 0, IF(AND(N67=\"Environmental Easement\", O67=\"Easement\"), 0.02, IF(AND(N67=\"Environmental Easement\", O67=\"Accredited Easement\"), 0.03, IF(AND(N67=\"Public Land\", O67=\"Public Land MOA\"), 0.02, 0))))))))))))","v":0}]
[null,{"$f":"B67","v":"Not Selected"},"Proposed","Select from Dropdown","Select",null,null,{"$f":"H67","v":"Select"},0,{"$f":"IF(H69=\"Second\",(F69*G69*H70*1), IF(H69=\"Third\",(F69*G69*H70*1), (F69*G69*H70*I70)))","v":0},null,0.5,{"$f":"IF(D69=\"Preservation\",((J69*0.1)*M67),(K67+L70)*M67)","v":0},{"$f":"IF(H67=\"Second\",(J69*N68),IF(H67=\"Third\",(J69*N68),(J69/I70*N68)))","v":{"$error":"#DIV/0!"}}]
[null,null,null,null,null,null,null,{"$f":"IF(H69=\"Primary\",1,IF(H69=\"Second\",0.2,IF(H69=\"Third\",0.1,IF(H69=\"Select\",0))))","v":0},{"$f":"IF(AND(B69=\"Piedmont\",I69>0.0001,I69<0.1),0.41, IF(AND(B69=\"Piedmont\",I69>10), 2.45, IF(B69=\"Piedmont\",I69^0.39, IF(AND(B69=\"Coastal Plain\",I69>0.0001,I69<0.1),0.42,IF(AND(B69=\"Coastal Plain\",I69>10),2.4, IF(B69=\"Coastal Plain\",I69^0.38, IF(AND(B69=\"Mountain\",I69>0.0001,I69<0.1),0.36,IF(AND(B69=\"Mountain\",I69>10),2.75,IF(B69=\"Mountain\",I69^0.44)))))))))","v":false},null,null,{"$f":"IF(AND(H67=\"Primary\",L67=\"Length Loss\"), L68*G67*I68*L69*-1,IF(AND(H67=\"Primary\", L67=\"Length Gain\"),L68*G69*I70*L69*-1,0))","v":0}]
[null,"Not Selected","Existing","Preliminary Resource Evaluation","Select",null,null,"Select",null,{"$f":"IF(H71=\"Second\",(F71*G71*H72*1), IF(H71=\"Third\",(F71*G71*H72*1), (F71*G71*H72*I72)))","v":0},{"$f":" J73-J71","v":0},{"$f":"IF(F71>F73, \"Length Loss\", IF(F71<F73, \"Length Gain\", IF(F71=F73, \"No Change\")))","v":"No Change"},0,"Existing: Select From Dropdown","Proposed: Select From Dropdown",{"$f":"IF(D73=\"Restoration/Enhancement\",SUM(K71,L74,M73,N73),IF(D73=\"Preservation\",((0.1*J73)+M73+N73),\"NA\"))","v":"NA"}]
[null,null,null,null,null,null,null,{"$f":"IF(H71=\"Primary\",1,IF(H71=\"Second\",0.2,IF(H71=\"Third\",0.1,IF(H71=\"Select\",0))))","v":0},{"$f":"IF(AND(B71=\"Piedmont\",I71>0.0001,I71<0.1),0.41, IF(AND(B71=\"Piedmont\",I71>10), 2.45, IF(B71=\"Piedmont\",I71^0.39, IF(AND(B71=\"Coastal Plain\",I71>0.0001,I71<0.1),0.42,IF(AND(B71=\"Coastal Plain\",I71>10),2.4, IF(B71=\"Coastal Plain\",I71^0.38, IF(AND(B71=\"Mountain\",I71>0.0001,I71<0.1),0.36,IF(AND(B71=\"Mountain\",I71>10),2.75,IF(B71=\"Mountain\",I71^0.44)))))))))","v":false},null,null,{"$f":"F73-F71","v":0},null,{"$f":"IF(AND(N71=\"No Existing Protection\",O71=\"Deed Restriction\"), 0.02, IF(AND(N71=\"No Existing Protection\",O71=\"Easement\"), 0.05, IF(AND(N71=\"No Existing Protection\", O71=\"Accredited Easement\"), 0.07, IF(AND(N71=\"No Existing Protection\", O71=\"Fee Simple to Conservation Holder\"), 0.09, IF(AND(N71=\"Agricultural Easement\",O71=\"Deed Restriction\"), 0.01, IF(AND(N71=\"Agricultural Easement\",O71=\"Easement\"), 0.04, IF(AND(N71=\"Agricultural Easement\", O71=\"Accredited Easement\"), 0.06, IF(AND(N71=\"Agricultural Easement\", O71=\"Fee Simple to Conservation Holder\"), 0.09, IF(AND(N71=\"Environmental Easement\",O71=\"Deed Restriction\"), 0, IF(AND(N71=\"Environmental Easement\", O71=\"Easement\"), 0.02, IF(AND(N71=\"Environmental Easement\", O71=\"Accredited Easement\"), 0.03, IF(AND(N71=\"Public Land\", O71=\"Public Land MOA\"), 0.02, 0))))))))))))","v":0}]
[null,{"$f":"B71","v":"Not Selected"},"Proposed","Select from Dropdown","Select",null,null,{"$f":"H71","v":"Select"},0,{"$f":"IF(H73=\"Second\",(F73*G73*H74*1), IF(H73=\"Third\",(F73*G73*H74*1), (F73*G73*H74*I74)))","v":0},null,0.5,{"$f":"IF(D73=\"Preservation\",((J73*0.1)*M71),(K71+L74)*M71)","v":0},{"$f":"IF(H71=\"Second\",(J73*N72),IF(H71=\"Third\",(J73*N72),(J73/I74*N72)))","v":{"$error":"#DIV/0!"}}]
[null,null,null,null,null,null,null,{"$f":"IF(H73=\"Primary\",1,IF(H73=\"Second\",0.2,IF(H73=\"Third\",0.1,IF(H73=\"Select\",0))))","v":0},{"$f":"IF(AND(B73=\"Piedmont\",I73>0.0001,I73<0.1),0.41, IF(AND(B73=\"Piedmont\",I73>10), 2.45, IF(B73=\"Piedmont\",I73^0.39, IF(AND(B73=\"Coastal Plain\",I73>0.0001,I73<0.1),0.42,IF(AND(B73=\"Coastal Plain\",I73>10),2.4, IF(B73=\"Coastal Plain\",I73^0.38, IF(AND(B73=\"Mountain\",I73>0.0001,I73<0.1),0.36,IF(AND(B73=\"Mountain\",I73>10),2.75,IF(B73=\"Mountain\",I73^0.44)))))))))","v":false},null,null,{"$f":"IF(AND(H71=\"Primary\",L71=\"Length Loss\"), L72*G71*I72*L73*-1,IF(AND(H71=\"Primary\", L71=\"Length Gain\"),L72*G73*I74*L73*-1,0))","v":0}]
[null,"Not Selected","Existing","Preliminary Resource Evaluation","Select",null,null,"Select",null,{"$f":"IF(H75=\"Second\",(F75*G75*H76*1), IF(H75=\"Third\",(F75*G75*H76*1), (F75*G75*H76*I76)))","v":0},{"$f":" J77-J75","v":0},{"$f":"IF(F75>F77, \"Length Loss\", IF(F75<F77, \"Length Gain\", IF(F75=F77, \"No Change\")))","v":"No Change"},0,"Existing: Select From Dropdown","Proposed: Select From Dropdown",{"$f":"IF(D77=\"Restoration/Enhancement\",SUM(K75,L78,M77,N77),IF(D77=\"Preservation\",((0.1*J77)+M77+N77),\"NA\"))","v":"NA"}]
[null,null,null,null,null,null,null,{"$f":"IF(H75=\"Primary\",1,IF(H75=\"Second\",0.2,IF(H75=\"Third\",0.1,IF(H75=\"Select\",0))))","v":0},{"$f":"IF(AND(B75=\"Piedmont\",I75>0.0001,I75<0.1),0.41, IF(AND(B75=\"Piedmont\",I75>10), 2.45, IF(B75=\"Piedmont\",I75^0.39, IF(AND(B75=\"Coastal Plain\",I75>0.0001,I75<0.1),0.42,IF(AND(B75=\"Coastal Plain\",I75>10),2.4, IF(B75=\"Coastal Plain\",I75^0.38, IF(AND(B75=\"Mountain\",I75>0.0001,I75<0.1),0.36,IF(AND(B75=\"Mountain\",I75>10),2.75,IF(B75=\"Mountain\",I75^0.44)))))))))","v":false},null,null,{"$f":"F77-F75","v":0},null,{"$f":"IF(AND(N75=\"No Existing Protection\",O75=\"Deed Restriction\"), 0.02, IF(AND(N75=\"No Existing Protection\",O75=\"Easement\"), 0.05, IF(AND(N75=\"No Existing Protection\", O75=\"Accredited Easement\"), 0.07, IF(AND(N75=\"No Existing Protection\", O75=\"Fee Simple to Conservation Holder\"), 0.09, IF(AND(N75=\"Agricultural Easement\",O75=\"Deed Restriction\"), 0.01, IF(AND(N75=\"Agricultural Easement\",O75=\"Easement\"), 0.04, IF(AND(N75=\"Agricultural Easement\", O75=\"Accredited Easement\"), 0.06, IF(AND(N75=\"Agricultural Easement\", O75=\"Fee Simple to Conservation Holder\"), 0.09, IF(AND(N75=\"Environmental Easement\",O75=\"Deed Restriction\"), 0, IF(AND(N75=\"Environmental Easement\", O75=\"Easement\"), 0.02, IF(AND(N75=\"Environmental Easement\", O75=\"Accredited Easement\"), 0.03, IF(AND(N75=\"Public Land\", O75=\"Public Land MOA\"), 0.02, 0))))))))))))","v":0}]
[null,{"$f":"B75","v":"Not Selected"},"Proposed","Select from Dropdown","Select",null,null,{"$f":"H75","v":"Select"},0,{"$f":"IF(H77=\"Second\",(F77*G77*H78*1), IF(H77=\"Third\",(F77*G77*H78*1), (F77*G77*H78*I78)))","v":0},null,0.5,{"$f":"IF(D77=\"Preservation\",((J77*0.1)*M75),(K75+L78)*M75)","v":0},{"$f":"IF(H75=\"Second\",(J77*N76),IF(H75=\"Third\",(J77*N76),(J77/I78*N76)))","v":{"$error":"#DIV/0!"}}]
[null,null,null,null,null,null,null,{"$f":"IF(H77=\"Primary\",1,IF(H77=\"Second\",0.2,IF(H77=\"Third\",0.1,IF(H77=\"Select\",0))))","v":0},{"$f":"IF(AND(B77=\"Piedmont\",I77>0.0001,I77<0.1),0.41, IF(AND(B77=\"Piedmont\",I77>10), 2.45, IF(B77=\"Piedmont\",I77^0.39, IF(AND(B77=\"Coastal Plain\",I77>0.0001,I77<0.1),0.42,IF(AND(B77=\"Coastal Plain\",I77>10),2.4, IF(B77=\"Coastal Plain\",I77^0.38, IF(AND(B77=\"Mountain\",I77>0.0001,I77<0.1),0.36,IF(AND(B77=\"Mountain\",I77>10),2.75,IF(B77=\"Mountain\",I77^0.44)))))))))","v":false},null,null,{"$f":"IF(AND(H75=\"Primary\",L75=\"Length Loss\"), L76*G75*I76*L77*-1,IF(AND(H75=\"Primary\", L75=\"Length Gain\"),L76*G77*I78*L77*-1,0))","v":0}]
[null,"Not Selected","Existing","Preliminary Resource Evaluation","Select",null,null,"Select",null,{"$f":"IF(H79=\"Second\",(F79*G79*H80*1), IF(H79=\"Third\",(F79*G79*H80*1), (F79*G79*H80*I80)))","v":0},{"$f":" J81-J79","v":0},{"$f":"IF(F79>F81, \"Length Loss\", IF(F79<F81, \"Length Gain\", IF(F79=F81, \"No Change\")))","v":"No Change"},0,"Existing: Select From Dropdown","Proposed: Select From Dropdown",{"$f":"IF(D81=\"Restoration/Enhancement\",SUM(K79,L82,M81,N81),IF(D81=\"Preservation\",((0.1*J81)+M81+N81),\"NA\"))","v":"NA"}]
[null,null,null,null,null,null,null,{"$f":"IF(H79=\"Primary\",1,IF(H79=\"Second\",0.2,IF(H79=\"Third\",0.1,IF(H79=\"Select\",0))))","v":0},{"$f":"IF(AND(B79=\"Piedmont\",I79>0.0001,I79<0.1),0.41, IF(AND(B79=\"Piedmont\",I79>10), 2.45, IF(B79=\"Piedmont\",I79^0.39, IF(AND(B79=\"Coastal Plain\",I79>0.0001,I79<0.1),0.42,IF(AND(B79=\"Coastal Plain\",I79>10),2.4, IF(B79=\"Coastal Plain\",I79^0.38, IF(AND(B79=\"Mountain\",I79>0.0001,I79<0.1),0.36,IF(AND(B79=\"Mountain\",I79>10),2.75,IF(B79=\"Mountain\",I79^0.44)))))))))","v":false},null,null,{"$f":"F81-F79","v":0},null,{"$f":"IF(AND(N79=\"No Existing Protection\",O79=\"Deed Restriction\"), 0.02, IF(AND(N79=\"No Existing Protection\",O79=\"Easement\"), 0.05, IF(AND(N79=\"No Existing Protection\", O79=\"Accredited Easement\"), 0.07, IF(AND(N79=\"No Existing Protection\", O79=\"Fee Simple to Conservation Holder\"), 0.09, IF(AND(N79=\"Agricultural Easement\",O79=\"Deed Restriction\"), 0.01, IF(AND(N79=\"Agricultural Easement\",O79=\"Easement\"), 0.04, IF(AND(N79=\"Agricultural Easement\", O79=\"Accredited Easement\"), 0.06, IF(AND(N79=\"Agricultural Easement\", O79=\"Fee Simple to Conservation Holder\"), 0.09, IF(AND(N79=\"Environmental Easement\",O79=\"Deed Restriction\"), 0, IF(AND(N79=\"Environmental Easement\", O79=\"Easement\"), 0.02, IF(AND(N79=\"Environmental Easement\", O79=\"Accredited Easement\"), 0.03, IF(AND(N79=\"Public Land\", O79=\"Public Land MOA\"), 0.02, 0))))))))))))","v":0}]
[null,{"$f":"B79","v":"Not Selected"},"Proposed","Select from Dropdown","Select",null,null,{"$f":"H79","v":"Select"},0,{"$f":"IF(H81=\"Second\",(F81*G81*H82*1), IF(H81=\"Third\",(F81*G81*H82*1), (F81*G81*H82*I82)))","v":0},null,0.5,{"$f":"IF(D81=\"Preservation\",((J81*0.1)*M79),(K79+L82)*M79)","v":0},{"$f":"IF(H79=\"Second\",(J81*N80),IF(H79=\"Third\",(J81*N80),(J81/I82*N80)))","v":{"$error":"#DIV/0!"}}]
[null,null,null,null,null,null,null,{"$f":"IF(H81=\"Primary\",1,IF(H81=\"Second\",0.2,IF(H81=\"Third\",0.1,IF(H81=\"Select\",0))))","v":0},{"$f":"IF(AND(B81=\"Piedmont\",I81>0.0001,I81<0.1),0.41, IF(AND(B81=\"Piedmont\",I81>10), 2.45, IF(B81=\"Piedmont\",I81^0.39, IF(AND(B81=\"Coastal Plain\",I81>0.0001,I81<0.1),0.42,IF(AND(B81=\"Coastal Plain\",I81>10),2.4, IF(B81=\"Coastal Plain\",I81^0.38, IF(AND(B81=\"Mountain\",I81>0.0001,I81<0.1),0.36,IF(AND(B81=\"Mountain\",I81>10),2.75,IF(B81=\"Mountain\",I81^0.44)))))))))","v":false},null,null,{"$f":"IF(AND(H79=\"Primary\",L79=\"Length Loss\"), L80*G79*I80*L81*-1,IF(AND(H79=\"Primary\", L79=\"Length Gain\"),L80*G81*I82*L81*-1,0))","v":0}]
[null,"Not Selected","Existing","Preliminary Resource Evaluation","Select",null,null,"Select",null,{"$f":"IF(H83=\"Second\",(F83*G83*H84*1), IF(H83=\"Third\",(F83*G83*H84*1), (F83*G83*H84*I84)))","v":0},{"$f":" J85-J83","v":0},{"$f":"IF(F83>F85, \"Length Loss\", IF(F83<F85, \"Length Gain\", IF(F83=F85, \"No Change\")))","v":"No Change"},0,"Existing: Select From Dropdown","Proposed: Select From Dropdown",{"$f":"IF(D85=\"Restoration/Enhancement\",SUM(K83,L86,M85,N85),IF(D85=\"Preservation\",((0.1*J85)+M85+N85),\"NA\"))","v":"NA"}]
[null,null,null,null,null,null,null,{"$f":"IF(H83=\"Primary\",1,IF(H83=\"Second\",0.2,IF(H83=\"Third\",0.1,IF(H83=\"Select\",0))))","v":0},{"$f":"IF(AND(B83=\"Piedmont\",I83>0.0001,I83<0.1),0.41, IF(AND(B83=\"Piedmont\",I83>10), 2.45, IF(B83=\"Piedmont\",I83^0.39, IF(AND(B83=\"Coastal Plain\",I83>0.0001,I83<0.1),0.42,IF(AND(B83=\"Coastal Plain\",I83>10),2.4, IF(B83=\"Coastal Plain\",I83^0.38, IF(AND(B83=\"Mountain\",I83>0.0001,I83<0.1),0.36,IF(AND(B83=\"Mountain\",I83>10),2.75,IF(B83=\"Mountain\",I83^0.44)))))))))","v":false},null,null,{"$f":"F85-F83","v":0},null,{"$f":"IF(AND(N83=\"No Existing Protection\",O83=\"Deed Restriction\"), 0.02, IF(AND(N83=\"No Existing Protection\",O83=\"Easement\"), 0.05, IF(AND(N83=\"No Existing Protection\", O83=\"Accredited Easement\"), 0.07, IF(AND(N83=\"No Existing Protection\", O83=\"Fee Simple to Conservation Holder\"), 0.09, IF(AND(N83=\"Agricultural Easement\",O83=\"Deed Restriction\"), 0.01, IF(AND(N83=\"Agricultural Easement\",O83=\"Easement\"), 0.04, IF(AND(N83=\"Agricultural Easement\", O83=\"Accredited Easement\"), 0.06, IF(AND(N83=\"Agricultural Easement\", O83=\"Fee Simple to Conservation Holder\"), 0.09, IF(AND(N83=\"Environmental Easement\",O83=\"Deed Restriction\"), 0, IF(AND(N83=\"Environmental Easement\", O83=\"Easement\"), 0.02, IF(AND(N83=\"Environmental Easement\", O83=\"Accredited Easement\"), 0.03, IF(AND(N83=\"Public Land\", O83=\"Public Land MOA\"), 0.02, 0))))))))))))","v":0}]
[null,{"$f":"B83","v":"Not Selected"},"Proposed","Select from Dropdown","Select",null,null,{"$f":"H83","v":"Select"},0,{"$f":"IF(H85=\"Second\",(F85*G85*H86*1), IF(H85=\"Third\",(F85*G85*H86*1), (F85*G85*H86*I86)))","v":0},null,0.5,{"$f":"IF(D85=\"Preservation\",((J85*0.1)*M83),(K83+L86)*M83)","v":0},{"$f":"IF(H83=\"Second\",(J85*N84),IF(H83=\"Third\",(J85*N84),(J85/I86*N84)))","v":{"$error":"#DIV/0!"}}]
[null,null,null,null,null,null,null,{"$f":"IF(H85=\"Primary\",1,IF(H85=\"Second\",0.2,IF(H85=\"Third\",0.1,IF(H85=\"Select\",0))))","v":0},{"$f":"IF(AND(B85=\"Piedmont\",I85>0.0001,I85<0.1),0.41, IF(AND(B85=\"Piedmont\",I85>10), 2.45, IF(B85=\"Piedmont\",I85^0.39, IF(AND(B85=\"Coastal Plain\",I85>0.0001,I85<0.1),0.42,IF(AND(B85=\"Coastal Plain\",I85>10),2.4, IF(B85=\"Coastal Plain\",I85^0.38, IF(AND(B85=\"Mountain\",I85>0.0001,I85<0.1),0.36,IF(AND(B85=\"Mountain\",I85>10),2.75,IF(B85=\"Mountain\",I85^0.44)))))))))","v":false},null,null,{"$f":"IF(AND(H83=\"Primary\",L83=\"Length Loss\"), L84*G83*I84*L85*-1,IF(AND(H83=\"Primary\", L83=\"Length Gain\"),L84*G85*I86*L85*-1,0))","v":0}]

{"sheet":"4_Stream Mitigation-Buffers","index":3,"n_rows":64,"n_cols":14,"rows_kept":64,"cut":false,"hidden":false,"merged":[[12,10,12,11],[14,10,14,11],[15,10,15,11],[17,10,17,11],[18,10,18,11],[20,10,20,11],[21,10,21,11],[23,10,23,11],[24,10,24,11],[61,0,62,1],[61,8,62,8],[61,12,63,12],[61,13,63,17],[63,0,63,8],[58,0,59,1],[58,8,59,8],[58,12,60,12],[58,13,60,17],[60,0,60,8],[59,10,59,11],[60,10,60,11],[62,10,62,11],[63,10,63,11],[58,9,59,9],[61,9,62,9],[55,0,56,1],[55,8,56,8],[55,12,57,12],[55,13,57,17],[57,0,57,8],[52,0,53,1],[52,8,53,8],[52,12,54,12],[52,13,54,17],[54,0,54,8],[53,10,53,11],[54,10,54,11],[56,10,56,11],[57,10,57,11],[52,9,53,9],[55,9,56,9],[49,0,50,1],[49,8,50,8],[49,12,51,12],[49,13,51,17],[51,0,51,8],[46,0,47,1],[46,8,47,8],[46,12,48,12],[46,13,48,17],[48,0,48,8],[47,10,47,11],[48,10,48,11],[50,10,50,11],[51,10,51,11],[46,9,47,9],[49,9,50,9],[43,0,44,1],[43,8,44,8],[43,12,45,12],[43,13,45,17],[45,0,45,8],[40,0,41,1],[40,8,41,8],[40,12,42,12],[40,13,42,17],[42,0,42,8],[41,10,41,11],[42,10,42,11],[44,10,44,11],[45,10,45,11],[40,9,41,9],[43,9,44,9],[37,0,38,1],[37,8,38,8],[37,12,39,12],[37,13,39,17],[39,0,39,8],[34,0,35,1],[34,8,35,8],[34,12,36,12],[34,13,36,17],[36,0,36,8],[35,10,35,11],[36,10,36,11],[38,10,38,11],[39,10,39,11],[31,0,32,1],[31,8,32,8],[31,12,33,12],[31,13,33,17],[33,0,33,8],[28,0,29,1],[28,8,29,8],[28,12,30,12],[28,13,30,17],[30,0,30,8],[29,10,29,11],[30,10,30,11],[32,10,32,11],[33,10,33,11],[25,0,26,1],[25,8,26,8],[25,12,27,12],[25,13,27,17],[27,0,27,8],[22,0,23,1],[22,8,23,8],[22,12,24,12],[22,13,24,17],[24,0,24,8],[26,10,26,11],[27,10,27,11],[19,0,20,1],[19,8,20,8],[19,12,21,12],[19,13,21,17],[21,0,21,8],[16,0,17,1],[16,8,17,8],[16,12,18,12],[16,13,18,17],[18,0,18,8],[13,0,14,1],[13,8,14,8],[13,12,15,12],[13,13,15,17],[15,0,15,8],[2,13,3,17],[8,3,9,3],[4,6,4,7],[4,8,4,12],[5,0,5,2],[6,6,6,7],[6,8,6,12],[2,0,2,12],[3,0,3,2],[3,3,3,5],[3,6,3,7],[3,8,3,12],[4,0,4,2],[4,3,4,5],[4,13,6,17],[10,8,11,8],[12,0,12,8],[10,12,12,12],[10,13,12,17],[10,0,11,1],[7,0,7,8],[8,8,9,8],[0,0,1,17],[8,2,9,2],[8,6,9,6],[8,7,9,7],[7,13,9,17],[8,4,9,4],[8,5,9,5],[8,0,9,1],[8,9,9,9],[5,3,5,5],[5,6,5,7],[5,8,5,12],[6,0,6,2],[6,3,6,5],[7,12,9,12],[7,9,7,11],[8,10,9,11],[11,10,11,11],[10,9,11,9],[13,9,14,9],[16,9,17,9],[19,9,20,9],[22,9,23,9],[25,9,26,9],[28,9,29,9],[31,9,32,9],[34,9,35,9],[37,9,38,9]]}
["STREAM MITIGATION CALCULATOR for Stream Buffers"]
[]
["BACKGROUND INFORMATION  ",null,null,null,null,null,null,null,null,null,null,null,null," Total Stream Gains from Buffers (Functional Feet)"]
["Corps Project ID #:",null,null,"NAB-2023-88552",null,null,"Corps PM:",null,"James Brown"]
["Project Name:",null,null,"Panther Branch Mit",null,null,"Date:",null,"2023-02-23",null,null,null,null,{"$f":"SUM(M11:M64)","v":216.5625}]
["Lat/Long:",null,null,"38.58960,-76.9567",null,null,"Sponsor:",null,"Acme Airports"]
["County:",null,null,"Baltimore ",null,null,"Collaborators: ",null,"DBT, CKL"]
["Raw Change in Buffer Value",null,null,null,null,null,null,null,null,"Adjustments",null,null,"Stream Gains (Functional Feet)","REMARKS                       (include CSBA Coordinates)"]
["Credited Stream Buffer Area Name (CBSA)",null,"Activity","Evaluation","Buffer Area (Acres)","Buffer Quality","Quality Acres","Raw Buffer Value (Functional Feet)","Raw Change in Buffer Value (Functional Feet)","Site Sensitivity","Site Protection"]
[]
["CSBA 1 mature forest",null,"Preliminary Resource Eval","Existing Buffer",4,0.75,{"$f":"E11*F11","v":3},{"$f":"G11*75","v":225},{"$f":"H12-H11","v":0},0.1,"Agricultural Easement","Easement",{"$f":"IF(C12=\"Preservation\", (H12+J13+K13)*0.25, SUM(I11,J13,K13))","v":59.0625}," 38.58960, -78.9565. Preservation of mature forest.  "]
[null,null,"Preservation","Proposed Buffer",4,0.75,{"$f":"E12*F12","v":3},{"$f":"G12*75","v":225},null,null,{"$f":"IF(AND(K11=\"No Existing Protection\",L11=\"Deed Restriction\"), 0.02, IF(AND(K11=\"No Existing Protection\",L11=\"Easement\"), 0.05, IF(AND(K11=\"No Existing Protection\", L11=\"Accredited Easement\"), 0.07, IF(AND(K11=\"No Existing Protection\", L11=\"Fee Simple to Conservation Holder\"), 0.09, IF(AND(K11=\"Agricultural Easement\",L11=\"Deed Restriction\"), 0.01, IF(AND(K11=\"Agricultural Easement\",L11=\"Easement\"), 0.04, IF(AND(K11=\"Agricultural Easement\", L11=\"Accredited Easement\"), 0.06, IF(AND(K11=\"Agricultural Easement\", L11=\"Fee Simple to Conservation Holder\"), 0.09, IF(AND(K11=\"Environmental Easement\",L11=\"Deed Restriction\"), 0, IF(AND(K11=\"Environmental Easement\", L11=\"Easement\"), 0.02, IF(AND(K11=\"Environmental Easement\", L11=\"Accredited Easement\"), 0.03, IF(AND(K11=\"Public Land\", L11=\"Public Land MOA\"), 0.02, 0))))))))))))","v":0.04}]
[null,null,null,null,null,null,null,null,null,{"$f":"IF(C12=\"Preservation\",((H11*0.1*J11)),I11*J11)","v":2.25},{"$f":"H12*K12","v":9}]
["CSBA 2 Pasture",null,"Preliminary Resource Eval","Existing Buffer",4,0.3,{"$f":"E14*F14","v":1.2},{"$f":"G14*75","v":90},{"$f":"H15-H14","v":135},0.1,"Agricultural Easement","Easement",{"$f":"IF(C15=\"Preservation\", (H15+J16+K16)*0.25, SUM(I14,J16,K16))","v":157.5},"38.58960, -78.9567. Forest buffer planted in pasture.  "]
[null,null,"Restoration/Enhancement","Proposed Buffer",4,0.75,{"$f":"E15*F15","v":3},{"$f":"G15*75","v":225},null,null,{"$f":"IF(AND(K14=\"No Existing Protection\",L14=\"Deed Restriction\"), 0.02, IF(AND(K14=\"No Existing Protection\",L14=\"Easement\"), 0.05, IF(AND(K14=\"No Existing Protection\", L14=\"Accredited Easement\"), 0.07, IF(AND(K14=\"No Existing Protection\", L14=\"Fee Simple to Conservation Holder\"), 0.09, IF(AND(K14=\"Agricultural Easement\",L14=\"Deed Restriction\"), 0.01, IF(AND(K14=\"Agricultural Easement\",L14=\"Easement\"), 0.04, IF(AND(K14=\"Agricultural Easement\", L14=\"Accredited Easement\"), 0.06, IF(AND(K14=\"Agricultural Easement\", L14=\"Fee Simple to Conservation Holder\"), 0.09, IF(AND(K14=\"Environmental Easement\",L14=\"Deed Restriction\"), 0, IF(AND(K14=\"Environmental Easement\", L14=\"Easement\"), 0.02, IF(AND(K14=\"Environmental Easement\", L14=\"Accredited Easement\"), 0.03, IF(AND(K14=\"Public Land\", L14=\"Public Land MOA\"), 0.02, 0))))))))))))","v":0.04}]
[null,null,null,null,null,null,null,null,null,{"$f":"IF(C15=\"Preservation\",((H14*0.1*J14)),I14*J14)","v":13.5},{"$f":"H15*K15","v":9}]
[null,null,"Preliminary Resource Eval","Existing Buffer",null,null,{"$f":"E17*F17","v":0},{"$f":"G17*75","v":0},{"$f":"H18-H17","v":0},0,"Existing: Select From Dropdown","Proposed: Select From Dropdown",{"$f":"IF(C18=\"Preservation\", (H18+J19+K19)*0.25, SUM(I17,J19,K19))","v":0}]
[null,null,"Select from Dropdown","Proposed Buffer",null,null,{"$f":"E18*F18","v":0},{"$f":"G18*75","v":0},null,null,{"$f":"IF(AND(K17=\"No Existing Protection\",L17=\"Deed Restriction\"), 0.02, IF(AND(K17=\"No Existing Protection\",L17=\"Easement\"), 0.05, IF(AND(K17=\"No Existing Protection\", L17=\"Accredited Easement\"), 0.07, IF(AND(K17=\"No Existing Protection\", L17=\"Fee Simple to Conservation Holder\"), 0.09, IF(AND(K17=\"Agricultural Easement\",L17=\"Deed Restriction\"), 0.01, IF(AND(K17=\"Agricultural Easement\",L17=\"Easement\"), 0.04, IF(AND(K17=\"Agricultural Easement\", L17=\"Accredited Easement\"), 0.06, IF(AND(K17=\"Agricultural Easement\", L17=\"Fee Simple to Conservation Holder\"), 0.09, IF(AND(K17=\"Environmental Easement\",L17=\"Deed Restriction\"), 0, IF(AND(K17=\"Environmental Easement\", L17=\"Easement\"), 0.02, IF(AND(K17=\"Environmental Easement\", L17=\"Accredited Easement\"), 0.03, IF(AND(K17=\"Public Land\", L17=\"Public Land MOA\"), 0.02, 0))))))))))))","v":0}]
[null,null,null,null,null,null,null,null,null,{"$f":"IF(C18=\"Preservation\",((H17*0.1*J18)),I17*J18)","v":0},{"$f":"H18*K18","v":0}]
[null,null,"Preliminary Resource Eval","Existing Buffer",null,null,{"$f":"E20*F20","v":0},{"$f":"G20*75","v":0},{"$f":"H21-H20","v":0},0,"Existing: Select From Dropdown","Proposed: Select From Dropdown",{"$f":"IF(C21=\"Preservation\", (H21+J22+K22)*0.25, SUM(I20,J22,K22))","v":0}]
[null,null,"Select from Dropdown","Proposed Buffer",null,null,0,0,null,null,{"$f":"IF(AND(K20=\"No Existing Protection\",L20=\"Deed Restriction\"), 0.02, IF(AND(K20=\"No Existing Protection\",L20=\"Easement\"), 0.05, IF(AND(K20=\"No Existing Protection\", L20=\"Accredited Easement\"), 0.07, IF(AND(K20=\"No Existing Protection\", L20=\"Fee Simple to Conservation Holder\"), 0.09, IF(AND(K20=\"Agricultural Easement\",L20=\"Deed Restriction\"), 0.01, IF(AND(K20=\"Agricultural Easement\",L20=\"Easement\"), 0.04, IF(AND(K20=\"Agricultural Easement\", L20=\"Accredited Easement\"), 0.06, IF(AND(K20=\"Agricultural Easement\", L20=\"Fee Simple to Conservation Holder\"), 0.09, IF(AND(K20=\"Environmental Easement\",L20=\"Deed Restriction\"), 0, IF(AND(K20=\"Environmental Easement\", L20=\"Easement\"), 0.02, IF(AND(K20=\"Environmental Easement\", L20=\"Accredited Easement\"), 0.03, IF(AND(K20=\"Public Land\", L20=\"Public Land MOA\"), 0.02, 0))))))))))))","v":0}]
[null,null,null,null,null,null,null,null,null,{"$f":"IF(C21=\"Preservation\",((H20*0.1*J21)),I20*J21)","v":0},{"$f":"H21*K21","v":0}]
[null,null,"Preliminary Resource Eval","Existing Buffer",null,null,{"$f":"E23*F23","v":0},{"$f":"G23*75","v":0},{"$f":"H24-H23","v":0},0,"Existing: Select From Dropdown","Proposed: Select From Dropdown",{"$f":"IF(C24=\"Preservation\", (H24+J25+K25)*0.25, SUM(I23,J25,K25))","v":0}]
[null,null,"Select from Dropdown","Proposed Buffer",null,null,0,0,null,null,{"$f":"IF(AND(K23=\"No Existing Protection\",L23=\"Deed Restriction\"), 0.02, IF(AND(K23=\"No Existing Protection\",L23=\"Easement\"), 0.05, IF(AND(K23=\"No Existing Protection\", L23=\"Accredited Easement\"), 0.07, IF(AND(K23=\"No Existing Protection\", L23=\"Fee Simple to Conservation Holder\"), 0.09, IF(AND(K23=\"Agricultural Easement\",L23=\"Deed Restriction\"), 0.01, IF(AND(K23=\"Agricultural Easement\",L23=\"Easement\"), 0.04, IF(AND(K23=\"Agricultural Easement\", L23=\"Accredited Easement\"), 0.06, IF(AND(K23=\"Agricultural Easement\", L23=\"Fee Simple to Conservation Holder\"), 0.09, IF(AND(K23=\"Environmental Easement\",L23=\"Deed Restriction\"), 0, IF(AND(K23=\"Environmental Easement\", L23=\"Easement\"), 0.02, IF(AND(K23=\"Environmental Easement\", L23=\"Accredited Easement\"), 0.03, IF(AND(K23=\"Public Land\", L23=\"Public Land MOA\"), 0.02, 0))))))))))))","v":0}]
[null,null,null,null,null,null,null,null,null,{"$f":"IF(C24=\"Preservation\",((H23*0.1*J24)),I23*J24)","v":0},{"$f":"H24*K24","v":0}]
[null,null,"Preliminary Resource Eval","Existing Buffer",null,null,{"$f":"E26*F26","v":0},{"$f":"G26*75","v":0},{"$f":"H27-H26","v":0},0,"Existing: Select From Dropdown","Proposed: Select From Dropdown",{"$f":"IF(C27=\"Preservation\", (H27+J28+K28)*0.25, SUM(I26,J28,K28))","v":0}]
[null,null,"Select from Dropdown","Proposed Buffer",null,null,0,0,null,null,{"$f":"IF(AND(K26=\"No Existing Protection\",L26=\"Deed Restriction\"), 0.02, IF(AND(K26=\"No Existing Protection\",L26=\"Easement\"), 0.05, IF(AND(K26=\"No Existing Protection\", L26=\"Accredited Easement\"), 0.07, IF(AND(K26=\"No Existing Protection\", L26=\"Fee Simple to Conservation Holder\"), 0.09, IF(AND(K26=\"Agricultural Easement\",L26=\"Deed Restriction\"), 0.01, IF(AND(K26=\"Agricultural Easement\",L26=\"Easement\"), 0.04, IF(AND(K26=\"Agricultural Easement\", L26=\"Accredited Easement\"), 0.06, IF(AND(K26=\"Agricultural Easement\", L26=\"Fee Simple to Conservation Holder\"), 0.09, IF(AND(K26=\"Environmental Easement\",L26=\"Deed Restriction\"), 0, IF(AND(K26=\"Environmental Easement\", L26=\"Easement\"), 0.02, IF(AND(K26=\"Environmental Easement\", L26=\"Accredited Easement\"), 0.03, IF(AND(K26=\"Public Land\", L26=\"Public Land MOA\"), 0.02, 0))))))))))))","v":0}]
[null,null,null,null,null,null,null,null,null,{"$f":"IF(C27=\"Preservation\",((H26*0.1*J27)),I26*J27)","v":0},{"$f":"H27*K27","v":0}]
[null,null,"Preliminary Resource Eval","Existing Buffer",null,null,{"$f":"E29*F29","v":0},{"$f":"G29*75","v":0},{"$f":"H30-H29","v":0},0,"Existing: Select From Dropdown","Proposed: Select From Dropdown",{"$f":"IF(C30=\"Preservation\", (H30+J31+K31)*0.25, SUM(I29,J31,K31))","v":0}]
[null,null,"Select from Dropdown","Proposed Buffer",null,null,0,0,null,null,{"$f":"IF(AND(K29=\"No Existing Protection\",L29=\"Deed Restriction\"), 0.02, IF(AND(K29=\"No Existing Protection\",L29=\"Easement\"), 0.05, IF(AND(K29=\"No Existing Protection\", L29=\"Accredited Easement\"), 0.07, IF(AND(K29=\"No Existing Protection\", L29=\"Fee Simple to Conservation Holder\"), 0.09, IF(AND(K29=\"Agricultural Easement\",L29=\"Deed Restriction\"), 0.01, IF(AND(K29=\"Agricultural Easement\",L29=\"Easement\"), 0.04, IF(AND(K29=\"Agricultural Easement\", L29=\"Accredited Easement\"), 0.06, IF(AND(K29=\"Agricultural Easement\", L29=\"Fee Simple to Conservation Holder\"), 0.09, IF(AND(K29=\"Environmental Easement\",L29=\"Deed Restriction\"), 0, IF(AND(K29=\"Environmental Easement\", L29=\"Easement\"), 0.02, IF(AND(K29=\"Environmental Easement\", L29=\"Accredited Easement\"), 0.03, IF(AND(K29=\"Public Land\", L29=\"Public Land MOA\"), 0.02, 0))))))))))))","v":0}]
[null,null,null,null,null,null,null,null,null,{"$f":"IF(C30=\"Preservation\",((H29*0.1*J30)),I29*J30)","v":0},{"$f":"H30*K30","v":0}]
[null,null,"Preliminary Resource Eval","Existing Buffer",null,null,{"$f":"E32*F32","v":0},{"$f":"G32*75","v":0},{"$f":"H33-H32","v":0},0,"Existing: Select From Dropdown","Proposed: Select From Dropdown",{"$f":"IF(C33=\"Preservation\", (H33+J34+K34)*0.25, SUM(I32,J34,K34))","v":0}]
[null,null,"Select from Dropdown","Proposed Buffer",null,null,0,0,null,null,{"$f":"IF(AND(K32=\"No Existing Protection\",L32=\"Deed Restriction\"), 0.02, IF(AND(K32=\"No Existing Protection\",L32=\"Easement\"), 0.05, IF(AND(K32=\"No Existing Protection\", L32=\"Accredited Easement\"), 0.07, IF(AND(K32=\"No Existing Protection\", L32=\"Fee Simple to Conservation Holder\"), 0.09, IF(AND(K32=\"Agricultural Easement\",L32=\"Deed Restriction\"), 0.01, IF(AND(K32=\"Agricultural Easement\",L32=\"Easement\"), 0.04, IF(AND(K32=\"Agricultural Easement\", L32=\"Accredited Easement\"), 0.06, IF(AND(K32=\"Agricultural Easement\", L32=\"Fee Simple to Conservation Holder\"), 0.09, IF(AND(K32=\"Environmental Easement\",L32=\"Deed Restriction\"), 0, IF(AND(K32=\"Environmental Easement\", L32=\"Easement\"), 0.02, IF(AND(K32=\"Environmental Easement\", L32=\"Accredited Easement\"), 0.03, IF(AND(K32=\"Public Land\", L32=\"Public Land MOA\"), 0.02, 0))))))))))))","v":0}]
[null,null,null,null,null,null,null,null,null,{"$f":"IF(C33=\"Preservation\",((H32*0.1*J33)),I32*J33)","v":0},{"$f":"H33*K33","v":0}]
[null,null,"Preliminary Resource Eval","Existing Buffer",null,null,{"$f":"E35*F35","v":0},{"$f":"G35*75","v":0},{"$f":"H36-H35","v":0},0,"Existing: Select From Dropdown","Proposed: Select From Dropdown",{"$f":"IF(C36=\"Preservation\", (H36+J37+K37)*0.25, SUM(I35,J37,K37))","v":0}]
[null,null,"Select from Dropdown","Proposed Buffer",null,null,0,0,null,null,{"$f":"IF(AND(K35=\"No Existing Protection\",L35=\"Deed Restriction\"), 0.02, IF(AND(K35=\"No Existing Protection\",L35=\"Easement\"), 0.05, IF(AND(K35=\"No Existing Protection\", L35=\"Accredited Easement\"), 0.07, IF(AND(K35=\"No Existing Protection\", L35=\"Fee Simple to Conservation Holder\"), 0.09, IF(AND(K35=\"Agricultural Easement\",L35=\"Deed Restriction\"), 0.01, IF(AND(K35=\"Agricultural Easement\",L35=\"Easement\"), 0.04, IF(AND(K35=\"Agricultural Easement\", L35=\"Accredited Easement\"), 0.06, IF(AND(K35=\"Agricultural Easement\", L35=\"Fee Simple to Conservation Holder\"), 0.09, IF(AND(K35=\"Environmental Easement\",L35=\"Deed Restriction\"), 0, IF(AND(K35=\"Environmental Easement\", L35=\"Easement\"), 0.02, IF(AND(K35=\"Environmental Easement\", L35=\"Accredited Easement\"), 0.03, IF(AND(K35=\"Public Land\", L35=\"Public Land MOA\"), 0.02, 0))))))))))))","v":0}]
[null,null,null,null,null,null,null,null,null,{"$f":"IF(C36=\"Preservation\",((H35*0.1*J36)),I35*J36)","v":0},{"$f":"H36*K36","v":0}]
[null,null,"Preliminary Resource Eval","Existing Buffer",null,null,{"$f":"E38*F38","v":0},{"$f":"G38*75","v":0},{"$f":"H39-H38","v":0},0,"Existing: Select From Dropdown","Proposed: Select From Dropdown",{"$f":"IF(C39=\"Preservation\", (H39+J40+K40)*0.25, SUM(I38,J40,K40))","v":0}]
[null,null,"Select from Dropdown","Proposed Buffer",null,null,0,0,null,null,{"$f":"IF(AND(K38=\"No Existing Protection\",L38=\"Deed Restriction\"), 0.02, IF(AND(K38=\"No Existing Protection\",L38=\"Easement\"), 0.05, IF(AND(K38=\"No Existing Protection\", L38=\"Accredited Easement\"), 0.07, IF(AND(K38=\"No Existing Protection\", L38=\"Fee Simple to Conservation Holder\"), 0.09, IF(AND(K38=\"Agricultural Easement\",L38=\"Deed Restriction\"), 0.01, IF(AND(K38=\"Agricultural Easement\",L38=\"Easement\"), 0.04, IF(AND(K38=\"Agricultural Easement\", L38=\"Accredited Easement\"), 0.06, IF(AND(K38=\"Agricultural Easement\", L38=\"Fee Simple to Conservation Holder\"), 0.09, IF(AND(K38=\"Environmental Easement\",L38=\"Deed Restriction\"), 0, IF(AND(K38=\"Environmental Easement\", L38=\"Easement\"), 0.02, IF(AND(K38=\"Environmental Easement\", L38=\"Accredited Easement\"), 0.03, IF(AND(K38=\"Public Land\", L38=\"Public Land MOA\"), 0.02, 0))))))))))))","v":0}]
[null,null,null,null,null,null,null,null,null,{"$f":"IF(C39=\"Preservation\",((H38*0.1*J39)),I38*J39)","v":0},{"$f":"H39*K39","v":0}]
[null,null,"Preliminary Resource Eval","Existing Buffer",null,null,{"$f":"E41*F41","v":0},{"$f":"G41*75","v":0},{"$f":"H42-H41","v":0},0,"Existing: Select From Dropdown","Proposed: Select From Dropdown",{"$f":"IF(C42=\"Preservation\", (H42+J43+K43)*0.25, SUM(I41,J43,K43))","v":0}]
[null,null,"Select from Dropdown","Proposed Buffer",null,null,0,0,null,null,{"$f":"IF(AND(K41=\"No Existing Protection\",L41=\"Deed Restriction\"), 0.02, IF(AND(K41=\"No Existing Protection\",L41=\"Easement\"), 0.05, IF(AND(K41=\"No Existing Protection\", L41=\"Accredited Easement\"), 0.07, IF(AND(K41=\"No Existing Protection\", L41=\"Fee Simple to Conservation Holder\"), 0.09, IF(AND(K41=\"Agricultural Easement\",L41=\"Deed Restriction\"), 0.01, IF(AND(K41=\"Agricultural Easement\",L41=\"Easement\"), 0.04, IF(AND(K41=\"Agricultural Easement\", L41=\"Accredited Easement\"), 0.06, IF(AND(K41=\"Agricultural Easement\", L41=\"Fee Simple to Conservation Holder\"), 0.09, IF(AND(K41=\"Environmental Easement\",L41=\"Deed Restriction\"), 0, IF(AND(K41=\"Environmental Easement\", L41=\"Easement\"), 0.02, IF(AND(K41=\"Environmental Easement\", L41=\"Accredited Easement\"), 0.03, IF(AND(K41=\"Public Land\", L41=\"Public Land MOA\"), 0.02, 0))))))))))))","v":0}]
[null,null,null,null,null,null,null,null,null,{"$f":"IF(C42=\"Preservation\",((H41*0.1*J42)),I41*J42)","v":0},{"$f":"H42*K42","v":0}]
[null,null,"Preliminary Resource Eval","Existing Buffer",null,null,{"$f":"E44*F44","v":0},{"$f":"G44*75","v":0},{"$f":"H45-H44","v":0},0,"Existing: Select From Dropdown","Proposed: Select From Dropdown",{"$f":"IF(C45=\"Preservation\", (H45+J46+K46)*0.25, SUM(I44,J46,K46))","v":0}]
[null,null,"Select from Dropdown","Proposed Buffer",null,null,0,0,null,null,{"$f":"IF(AND(K44=\"No Existing Protection\",L44=\"Deed Restriction\"), 0.02, IF(AND(K44=\"No Existing Protection\",L44=\"Easement\"), 0.05, IF(AND(K44=\"No Existing Protection\", L44=\"Accredited Easement\"), 0.07, IF(AND(K44=\"No Existing Protection\", L44=\"Fee Simple to Conservation Holder\"), 0.09, IF(AND(K44=\"Agricultural Easement\",L44=\"Deed Restriction\"), 0.01, IF(AND(K44=\"Agricultural Easement\",L44=\"Easement\"), 0.04, IF(AND(K44=\"Agricultural Easement\", L44=\"Accredited Easement\"), 0.06, IF(AND(K44=\"Agricultural Easement\", L44=\"Fee Simple to Conservation Holder\"), 0.09, IF(AND(K44=\"Environmental Easement\",L44=\"Deed Restriction\"), 0, IF(AND(K44=\"Environmental Easement\", L44=\"Easement\"), 0.02, IF(AND(K44=\"Environmental Easement\", L44=\"Accredited Easement\"), 0.03, IF(AND(K44=\"Public Land\", L44=\"Public Land MOA\"), 0.02, 0))))))))))))","v":0}]
[null,null,null,null,null,null,null,null,null,{"$f":"IF(C45=\"Preservation\",((H44*0.1*J45)),I44*J45)","v":0},{"$f":"H45*K45","v":0}]
[null,null,"Preliminary Resource Eval","Existing Buffer",null,null,{"$f":"E47*F47","v":0},{"$f":"G47*75","v":0},{"$f":"H48-H47","v":0},0,"Existing: Select From Dropdown","Proposed: Select From Dropdown",{"$f":"IF(C48=\"Preservation\", (H48+J49+K49)*0.25, SUM(I47,J49,K49))","v":0}]
[null,null,"Select from Dropdown","Proposed Buffer",null,null,0,0,null,null,{"$f":"IF(AND(K47=\"No Existing Protection\",L47=\"Deed Restriction\"), 0.02, IF(AND(K47=\"No Existing Protection\",L47=\"Easement\"), 0.05, IF(AND(K47=\"No Existing Protection\", L47=\"Accredited Easement\"), 0.07, IF(AND(K47=\"No Existing Protection\", L47=\"Fee Simple to Conservation Holder\"), 0.09, IF(AND(K47=\"Agricultural Easement\",L47=\"Deed Restriction\"), 0.01, IF(AND(K47=\"Agricultural Easement\",L47=\"Easement\"), 0.04, IF(AND(K47=\"Agricultural Easement\", L47=\"Accredited Easement\"), 0.06, IF(AND(K47=\"Agricultural Easement\", L47=\"Fee Simple to Conservation Holder\"), 0.09, IF(AND(K47=\"Environmental Easement\",L47=\"Deed Restriction\"), 0, IF(AND(K47=\"Environmental Easement\", L47=\"Easement\"), 0.02, IF(AND(K47=\"Environmental Easement\", L47=\"Accredited Easement\"), 0.03, IF(AND(K47=\"Public Land\", L47=\"Public Land MOA\"), 0.02, 0))))))))))))","v":0}]
[null,null,null,null,null,null,null,null,null,{"$f":"IF(C48=\"Preservation\",((H47*0.1*J48)),I47*J48)","v":0},{"$f":"H48*K48","v":0}]
[null,null,"Preliminary Resource Eval","Existing Buffer",null,null,{"$f":"E50*F50","v":0},{"$f":"G50*75","v":0},{"$f":"H51-H50","v":0},0,"Existing: Select From Dropdown","Proposed: Select From Dropdown",{"$f":"IF(C51=\"Preservation\", (H51+J52+K52)*0.25, SUM(I50,J52,K52))","v":0}]
[null,null,"Select from Dropdown","Proposed Buffer",null,null,0,0,null,null,{"$f":"IF(AND(K50=\"No Existing Protection\",L50=\"Deed Restriction\"), 0.02, IF(AND(K50=\"No Existing Protection\",L50=\"Easement\"), 0.05, IF(AND(K50=\"No Existing Protection\", L50=\"Accredited Easement\"), 0.07, IF(AND(K50=\"No Existing Protection\", L50=\"Fee Simple to Conservation Holder\"), 0.09, IF(AND(K50=\"Agricultural Easement\",L50=\"Deed Restriction\"), 0.01, IF(AND(K50=\"Agricultural Easement\",L50=\"Easement\"), 0.04, IF(AND(K50=\"Agricultural Easement\", L50=\"Accredited Easement\"), 0.06, IF(AND(K50=\"Agricultural Easement\", L50=\"Fee Simple to Conservation Holder\"), 0.09, IF(AND(K50=\"Environmental Easement\",L50=\"Deed Restriction\"), 0, IF(AND(K50=\"Environmental Easement\", L50=\"Easement\"), 0.02, IF(AND(K50=\"Environmental Easement\", L50=\"Accredited Easement\"), 0.03, IF(AND(K50=\"Public Land\", L50=\"Public Land MOA\"), 0.02, 0))))))))))))","v":0}]
[null,null,null,null,null,null,null,null,null,{"$f":"IF(C51=\"Preservation\",((H50*0.1*J51)),I50*J51)","v":0},{"$f":"H51*K51","v":0}]
[null,null,"Preliminary Resource Eval","Existing Buffer",null,null,{"$f":"E53*F53","v":0},{"$f":"G53*75","v":0},{"$f":"H54-H53","v":0},0,"Existing: Select From Dropdown","Proposed: Select From Dropdown",{"$f":"IF(C54=\"Preservation\", (H54+J55+K55)*0.25, SUM(I53,J55,K55))","v":0}]
[null,null,"Select from Dropdown","Proposed Buffer",null,null,0,0,null,null,{"$f":"IF(AND(K53=\"No Existing Protection\",L53=\"Deed Restriction\"), 0.02, IF(AND(K53=\"No Existing Protection\",L53=\"Easement\"), 0.05, IF(AND(K53=\"No Existing Protection\", L53=\"Accredited Easement\"), 0.07, IF(AND(K53=\"No Existing Protection\", L53=\"Fee Simple to Conservation Holder\"), 0.09, IF(AND(K53=\"Agricultural Easement\",L53=\"Deed Restriction\"), 0.01, IF(AND(K53=\"Agricultural Easement\",L53=\"Easement\"), 0.04, IF(AND(K53=\"Agricultural Easement\", L53=\"Accredited Easement\"), 0.06, IF(AND(K53=\"Agricultural Easement\", L53=\"Fee Simple to Conservation Holder\"), 0.09, IF(AND(K53=\"Environmental Easement\",L53=\"Deed Restriction\"), 0, IF(AND(K53=\"Environmental Easement\", L53=\"Easement\"), 0.02, IF(AND(K53=\"Environmental Easement\", L53=\"Accredited Easement\"), 0.03, IF(AND(K53=\"Public Land\", L53=\"Public Land MOA\"), 0.02, 0))))))))))))","v":0}]
[null,null,null,null,null,null,null,null,null,{"$f":"IF(C54=\"Preservation\",((H53*0.1*J54)),I53*J54)","v":0},{"$f":"H54*K54","v":0}]
[null,null,"Preliminary Resource Eval","Existing Buffer",null,null,{"$f":"E56*F56","v":0},{"$f":"G56*75","v":0},{"$f":"H57-H56","v":0},0,"Existing: Select From Dropdown","Proposed: Select From Dropdown",{"$f":"IF(C57=\"Preservation\", (H57+J58+K58)*0.25, SUM(I56,J58,K58))","v":0}]
[null,null,"Select from Dropdown","Proposed Buffer",null,null,0,0,null,null,{"$f":"IF(AND(K56=\"No Existing Protection\",L56=\"Deed Restriction\"), 0.02, IF(AND(K56=\"No Existing Protection\",L56=\"Easement\"), 0.05, IF(AND(K56=\"No Existing Protection\", L56=\"Accredited Easement\"), 0.07, IF(AND(K56=\"No Existing Protection\", L56=\"Fee Simple to Conservation Holder\"), 0.09, IF(AND(K56=\"Agricultural Easement\",L56=\"Deed Restriction\"), 0.01, IF(AND(K56=\"Agricultural Easement\",L56=\"Easement\"), 0.04, IF(AND(K56=\"Agricultural Easement\", L56=\"Accredited Easement\"), 0.06, IF(AND(K56=\"Agricultural Easement\", L56=\"Fee Simple to Conservation Holder\"), 0.09, IF(AND(K56=\"Environmental Easement\",L56=\"Deed Restriction\"), 0, IF(AND(K56=\"Environmental Easement\", L56=\"Easement\"), 0.02, IF(AND(K56=\"Environmental Easement\", L56=\"Accredited Easement\"), 0.03, IF(AND(K56=\"Public Land\", L56=\"Public Land MOA\"), 0.02, 0))))))))))))","v":0}]
[null,null,null,null,null,null,null,null,null,{"$f":"IF(C57=\"Preservation\",((H56*0.1*J57)),I56*J57)","v":0},{"$f":"H57*K57","v":0}]
[null,null,"Preliminary Resource Eval","Existing Buffer",null,null,{"$f":"E59*F59","v":0},{"$f":"G59*75","v":0},{"$f":"H60-H59","v":0},0,"Existing: Select From Dropdown","Proposed: Select From Dropdown",{"$f":"IF(C60=\"Preservation\", (H60+J61+K61)*0.25, SUM(I59,J61,K61))","v":0}]
[null,null,"Select from Dropdown","Proposed Buffer",null,null,0,0,null,null,{"$f":"IF(AND(K59=\"No Existing Protection\",L59=\"Deed Restriction\"), 0.02, IF(AND(K59=\"No Existing Protection\",L59=\"Easement\"), 0.05, IF(AND(K59=\"No Existing Protection\", L59=\"Accredited Easement\"), 0.07, IF(AND(K59=\"No Existing Protection\", L59=\"Fee Simple to Conservation Holder\"), 0.09, IF(AND(K59=\"Agricultural Easement\",L59=\"Deed Restriction\"), 0.01, IF(AND(K59=\"Agricultural Easement\",L59=\"Easement\"), 0.04, IF(AND(K59=\"Agricultural Easement\", L59=\"Accredited Easement\"), 0.06, IF(AND(K59=\"Agricultural Easement\", L59=\"Fee Simple to Conservation Holder\"), 0.09, IF(AND(K59=\"Environmental Easement\",L59=\"Deed Restriction\"), 0, IF(AND(K59=\"Environmental Easement\", L59=\"Easement\"), 0.02, IF(AND(K59=\"Environmental Easement\", L59=\"Accredited Easement\"), 0.03, IF(AND(K59=\"Public Land\", L59=\"Public Land MOA\"), 0.02, 0))))))))))))","v":0}]
[null,null,null,null,null,null,null,null,null,{"$f":"IF(C60=\"Preservation\",((H59*0.1*J60)),I59*J60)","v":0},{"$f":"H60*K60","v":0}]
[null,null,"Preliminary Resource Eval","Existing Buffer",null,null,{"$f":"E62*F62","v":0},{"$f":"G62*75","v":0},{"$f":"H63-H62","v":0},0,"Existing: Select From Dropdown","Proposed: Select From Dropdown",{"$f":"IF(C63=\"Preservation\", (H63+J64+K64)*0.25, SUM(I62,J64,K64))","v":0}]
[null,null,"Select from Dropdown","Proposed Buffer",null,null,0,0,null,null,{"$f":"IF(AND(K62=\"No Existing Protection\",L62=\"Deed Restriction\"), 0.02, IF(AND(K62=\"No Existing Protection\",L62=\"Easement\"), 0.05, IF(AND(K62=\"No Existing Protection\", L62=\"Accredited Easement\"), 0.07, IF(AND(K62=\"No Existing Protection\", L62=\"Fee Simple to Conservation Holder\"), 0.09, IF(AND(K62=\"Agricultural Easement\",L62=\"Deed Restriction\"), 0.01, IF(AND(K62=\"Agricultural Easement\",L62=\"Easement\"), 0.04, IF(AND(K62=\"Agricultural Easement\", L62=\"Accredited Easement\"), 0.06, IF(AND(K62=\"Agricultural Easement\", L62=\"Fee Simple to Conservation Holder\"), 0.09, IF(AND(K62=\"Environmental Easement\",L62=\"Deed Restriction\"), 0, IF(AND(K62=\"Environmental Easement\", L62=\"Easement\"), 0.02, IF(AND(K62=\"Environmental Easement\", L62=\"Accredited Easement\"), 0.03, IF(AND(K62=\"Public Land\", L62=\"Public Land MOA\"), 0.02, 0))))))))))))","v":0}]
[null,null,null,null,null,null,null,null,null,{"$f":"IF(C63=\"Preservation\",((H62*0.1*J63)),I62*J63)","v":0},{"$f":"H63*K63","v":0}]

{"sheet":"5_Bundled StreamChannel Mit ","index":4,"n_rows":86,"n_cols":17,"rows_kept":86,"cut":false,"hidden":false,"merged":[[82,15,85,15],[82,16,85,18],[83,13,83,14],[82,0,85,0],[82,1,83,1],[82,2,83,2],[82,3,83,3],[82,4,83,4],[82,5,83,5],[84,1,85,1],[84,2,85,2],[84,3,85,3],[84,4,85,4],[84,5,85,5],[84,6,85,6],[84,9,85,9],[84,12,85,12],[84,13,85,14],[82,6,83,6],[82,9,83,9],[82,10,85,10],[82,12,83,12],[78,0,81,0],[78,1,79,1],[78,2,79,2],[78,3,79,3],[78,4,79,4],[78,16,81,18],[79,13,79,14],[80,1,81,1],[80,2,81,2],[80,3,81,3],[80,4,81,4],[80,5,81,5],[80,6,81,6],[80,9,81,9],[80,12,81,12],[78,5,79,5],[78,6,79,6],[78,9,79,9],[78,10,81,10],[78,12,79,12],[78,15,81,15],[80,13,81,14],[74,6,75,6],[74,9,75,9],[74,10,77,10],[74,12,75,12],[74,15,77,15],[74,16,77,18],[75,13,75,14],[74,0,77,0],[74,1,75,1],[74,2,75,2],[74,3,75,3],[74,4,75,4],[74,5,75,5],[76,1,77,1],[76,2,77,2],[76,3,77,3],[76,4,77,4],[76,5,77,5],[76,6,77,6],[76,9,77,9],[76,12,77,12],[76,13,77,14],[70,0,73,0],[70,1,71,1],[70,2,71,2],[70,3,71,3],[70,4,71,4],[70,16,73,18],[71,13,71,14],[72,1,73,1],[72,2,73,2],[72,3,73,3],[72,4,73,4],[72,5,73,5],[72,6,73,6],[72,9,73,9],[72,12,73,12],[70,5,71,5],[70,6,71,6],[70,9,71,9],[70,10,73,10],[70,12,71,12],[70,15,73,15],[72,13,73,14],[66,6,67,6],[66,9,67,9],[66,10,69,10],[66,12,67,12],[66,15,69,15],[66,16,69,18],[67,13,67,14],[66,0,69,0],[66,1,67,1],[66,2,67,2],[66,3,67,3],[66,4,67,4],[66,5,67,5],[68,1,69,1],[68,2,69,2],[68,3,69,3],[68,4,69,4],[68,5,69,5],[68,6,69,6],[68,9,69,9],[68,12,69,12],[68,13,69,14],[62,0,65,0],[62,1,63,1],[62,2,63,2],[62,3,63,3],[62,4,63,4],[62,16,65,18],[63,13,63,14],[64,1,65,1],[64,2,65,2],[64,3,65,3],[64,4,65,4],[64,5,65,5],[64,6,65,6],[64,9,65,9],[64,12,65,12],[62,5,63,5],[62,6,63,6],[62,9,63,9],[62,10,65,10],[62,12,63,12],[62,15,65,15],[64,13,65,14],[58,6,59,6],[58,9,59,9],[58,10,61,10],[58,12,59,12],[58,15,61,15],[58,16,61,18],[59,13,59,14],[58,0,61,0],[58,1,59,1],[58,2,59,2],[58,3,59,3],[58,4,59,4],[58,5,59,5],[60,1,61,1],[60,2,61,2],[60,3,61,3],[60,4,61,4],[60,5,61,5],[60,6,61,6],[60,9,61,9],[60,12,61,12],[60,13,61,14],[54,0,57,0],[54,1,55,1],[54,2,55,2],[54,3,55,3],[54,4,55,4],[54,16,57,18],[55,13,55,14],[56,1,57,1],[56,2,57,2],[56,3,57,3],[56,4,57,4],[56,5,57,5],[56,6,57,6],[56,9,57,9],[56,12,57,12],[54,5,55,5],[54,6,55,6],[54,9,55,9],[54,10,57,10],[54,12,55,12],[54,15,57,15],[56,13,57,14],[50,6,51,6],[50,9,51,9],[50,10,53,10],[50,12,51,12],[50,15,53,15],[50,16,53,18],[51,13,51,14],[50,0,53,0],[50,1,51,1],[50,2,51,2],[50,3,51,3],[50,4,51,4],[50,5,51,5],[52,1,53,1],[52,2,53,2],[52,3,53,3],[52,4,53,4],[52,5,53,5],[52,6,53,6],[52,9,53,9],[52,12,53,12],[52,13,53,14],[46,0,49,0],[46,1,47,1],[46,2,47,2],[46,3,47,3],[46,4,47,4],[46,16,49,18],[47,13,47,14],[48,1,49,1],[48,2,49,2],[48,3,49,3],[48,4,49,4],[48,5,49,5],[48,6,49,6],[48,9,49,9],[48,12,49,12],[46,5,47,5],[46,6,47,6],[46,9,47,9],[46,10,49,10],[46,12,47,12],[46,15,49,15],[48,13,49,14],[42,6,43,6],[42,9,43,9],[42,10,45,10],[42,12,43,12],[42,15,45,15],[42,16,45,18],[43,13,43,14],[42,0,45,0],[42,1,43,1],[42,2,43,2],[42,3,43,3],[42,4,43,4],[42,5,43,5],[44,1,45,1],[44,2,45,2],[44,3,45,3],[44,4,45,4],[44,5,45,5],[44,6,45,6],[44,9,45,9],[44,12,45,12],[44,13,45,14],[38,0,41,0],[38,1,39,1],[38,2,39,2],[38,3,39,3],[38,4,39,4],[38,16,41,18],[39,13,39,14],[40,1,41,1],[40,2,41,2],[40,3,41,3],[40,4,41,4],[40,5,41,5],[40,6,41,6],[40,9,41,9],[40,12,41,12],[38,5,39,5],[38,6,39,6],[38,9,39,9],[38,10,41,10],[38,12,39,12],[38,15,41,15],[40,13,41,14],[34,6,35,6],[34,9,35,9],[34,10,37,10],[34,12,35,12],[34,15,37,15],[34,16,37,18],[35,13,35,14],[34,0,37,0],[34,1,35,1],[34,2,35,2],[34,3,35,3],[34,4,35,4],[34,5,35,5],[36,1,37,1],[36,2,37,2],[36,3,37,3],[36,4,37,4],[36,5,37,5],[36,6,37,6],[36,9,37,9],[36,12,37,12],[36,13,37,14],[30,0,33,0],[30,1,31,1],[30,2,31,2],[30,3,31,3],[30,4,31,4],[30,16,33,18],[31,13,31,14],[32,1,33,1],[32,2,33,2],[32,3,33,3],[32,4,33,4],[32,5,33,5],[32,6,33,6],[32,9,33,9],[32,12,33,12],[30,5,31,5],[30,6,31,6],[30,9,31,9],[30,10,33,10],[30,12,31,12],[30,15,33,15],[32,13,33,14],[26,6,27,6],[26,9,27,9],[26,10,29,10],[26,12,27,12],[26,15,29,15],[26,16,29,18],[27,13,27,14],[26,0,29,0],[26,1,27,1],[26,2,27,2],[26,3,27,3],[26,4,27,4],[26,5,27,5],[28,1,29,1],[28,2,29,2],[28,3,29,3],[28,4,29,4],[28,5,29,5],[28,6,29,6],[28,9,29,9],[28,12,29,12],[28,13,29,14],[22,0,25,0],[22,1,23,1],[22,2,23,2],[22,3,23,3],[22,4,23,4],[22,16,25,18],[23,13,23,14],[24,1,25,1],[24,2,25,2],[24,3,25,3],[24,4,25,4],[24,5,25,5],[24,6,25,6],[24,9,25,9],[24,12,25,12],[22,5,23,5],[22,6,23,6],[22,9,23,9],[22,10,25,10],[22,12,23,12],[22,15,25,15],[24,13,25,14],[18,6,19,6],[18,9,19,9],[18,10,21,10],[18,12,19,12],[18,15,21,15],[18,16,21,18],[19,13,19,14],[18,0,21,0],[18,1,19,1],[18,2,19,2],[18,3,19,3],[18,4,19,4],[18,5,19,5],[20,1,21,1],[20,2,21,2],[20,3,21,3],[20,4,21,4],[20,5,21,5],[20,6,21,6],[20,9,21,9],[20,12,21,12],[20,13,21,14],[14,16,17,18],[15,13,15,14],[16,9,17,9],[16,12,17,12],[16,13,17,14],[12,9,13,9],[12,12,13,12],[12,13,13,14],[10,16,13,18],[14,9,15,9],[14,10,17,10],[14,12,15,12],[14,0,17,0],[14,1,15,1],[14,2,15,2],[14,3,15,3],[14,4,15,4],[14,5,15,5],[14,6,15,6],[10,12,11,12],[10,15,13,15],[11,13,11,14],[12,1,13,1],[12,2,13,2],[12,3,13,3],[12,4,13,4],[12,5,13,5],[12,6,13,6],[14,15,17,15],[16,1,17,1],[16,2,17,2],[16,3,17,3],[16,4,17,4],[16,5,17,5],[16,6,17,6],[10,0,13,0],[10,1,11,1],[10,2,11,2],[10,3,11,3],[10,4,11,4],[10,5,11,5],[10,6,11,6],[10,9,11,9],[10,10,13,10],[7,0,7,10],[7,11,7,14],[7,15,9,15],[8,9,9,9],[8,10,9,10],[8,11,9,11],[8,12,9,12],[7,16,9,18],[8,0,9,0],[8,1,9,1],[8,2,9,2],[8,3,9,3],[8,4,9,4],[8,5,9,5],[8,6,9,6],[8,7,9,7],[8,8,9,8],[8,13,9,14],[0,0,1,18],[2,0,2,10],[2,12,3,18],[3,0,3,1],[3,2,3,4],[3,5,3,6],[3,7,3,10],[4,0,4,1],[4,2,4,4],[4,5,4,6],[4,7,4,10],[4,12,6,18],[5,0,5,1],[5,2,5,4],[5,5,5,6],[5,7,5,10],[6,0,6,1],[6,2,6,4],[6,5,6,6],[6,7,6,10]]}
["STREAM MITIGATION CALCULATOR for Stream Channels"]
[]
["BACKGROUND INFORMATION  ",null,null,null,null,null,null,null,null,null,null,null,"  TOTAL STREAM GAINS from Stream Channels (Functional Feet)"]
["Corps Project ID #:",null,null,null,null,"Corps PM:"]
["Project Name:",null,null,null,null,"Date:",null,null,null,null,null,null,{"$f":"SUM(P11:P86)","v":0}]
["Lat/Long:",null,null,null,null,"Sponsor:"]
["County:",null,null,null,null,"Collaborators: "]
["Raw Change in Reach Value (Functional Feet) ",null,null,null,null,null,null,null,null,null,null," Adjustments",null,null,null,"Stream Gains (Functional Feet)","REMARKS                (Incude reach coordinates)"]
["Reach Name","Physiographic Region","Evaluation","Activity","Resource Type","Length (Feet)","Stream Quality","Channel Thread","Drainage Area (sqmi)","Raw Reach Value (Functional Feet)","Raw Change in Value (Functional Feet)","Change in Reach Length Adjustment","Site Sensitivity","Site Protection"]
[]
[null,"Not Selected","Existing","Preliminary Resource Evaluation","Select",null,null,"Select",null,{"$f":"IF(H11=\"Second\",(F11*G11*H12*1), IF(H11=\"Third\",(F11*G11*H12*1), (F11*G11*H12*I12)))","v":0},{"$f":" J13-J11","v":0},{"$f":"IF(F11>F13, \"Length Loss\", IF(F11<F13, \"Length Gain\", IF(F11=F13, \"No Change\")))","v":"No Change"},0,"Existing: Select From Dropdown","Proposed: Select From Dropdown",{"$f":"IF(D13=\"Restoration/Enhancement\",SUM(K11,L14,M13,N13),IF(D13=\"Preservation\",((0.1*J13)+M13+N13),\"NA\"))","v":"NA"}]
[null,null,null,null,null,null,null,{"$f":"IF(H11=\"Primary\",1,IF(H11=\"Second\",0.2,IF(H11=\"Third\",0.1,IF(H11=\"Select\",0))))","v":0},{"$f":"IF(AND(B11=\"Piedmont\",I11>0.0001,I11<0.1),0.41, IF(AND(B11=\"Piedmont\",I11>10), 2.45, IF(B11=\"Piedmont\",I11^0.39, IF(AND(B11=\"Coastal Plain\",I11>0.0001,I11<0.1),0.42,IF(AND(B11=\"Coastal Plain\",I11>10),2.4, IF(B11=\"Coastal Plain\",I11^0.38, IF(AND(B11=\"Mountain\",I11>0.0001,I11<0.1),0.36,IF(AND(B11=\"Mountain\",I11>10),2.75,IF(B11=\"Mountain\",I11^0.44)))))))))","v":false},null,null,{"$f":"F13-F11","v":0},null,{"$f":"IF(AND(N11=\"No Existing Protection\",O11=\"Deed Restriction\"), 0.02, IF(AND(N11=\"No Existing Protection\",O11=\"Easement\"), 0.05, IF(AND(N11=\"No Existing Protection\", O11=\"Accredited Easement\"), 0.07, IF(AND(N11=\"No Existing Protection\", O11=\"Fee Simple to Conservation Holder\"), 0.09, IF(AND(N11=\"Agricultural Easement\",O11=\"Deed Restriction\"), 0.01, IF(AND(N11=\"Agricultural Easement\",O11=\"Easement\"), 0.04, IF(AND(N11=\"Agricultural Easement\", O11=\"Accredited Easement\"), 0.06, IF(AND(N11=\"Agricultural Easement\", O11=\"Fee Simple to Conservation Holder\"), 0.09, IF(AND(N11=\"Environmental Easement\",O11=\"Deed Restriction\"), 0, IF(AND(N11=\"Environmental Easement\", O11=\"Easement\"), 0.02, IF(AND(N11=\"Environmental Easement\", O11=\"Accredited Easement\"), 0.03, IF(AND(N11=\"Public Land\", O11=\"Public Land MOA\"), 0.02, 0))))))))))))","v":0}]
[null,{"$f":"B11","v":"Not Selected"},"Proposed","Select from Dropdown","Select",null,null,{"$f":"H11","v":"Select"},{"$f":"I11","v":0},{"$f":"IF(H13=\"Second\",(F13*G13*H14*1), IF(H13=\"Third\",(F13*G13*H14*1), (F13*G13*H14*I14)))","v":0},null,0.5,{"$f":"IF(D13=\"Preservation\",((J13*0.1)*M11),(K11+L14)*M11)","v":0},{"$f":"IF(H11=\"Second\",(J13*N12),IF(H11=\"Third\",(J13*N12),(J13/I14*N12)))","v":{"$error":"#DIV/0!"}}]
[null,null,null,null,null,null,null,{"$f":"IF(H13=\"Primary\",1,IF(H13=\"Second\",0.2,IF(H13=\"Third\",0.1,IF(H13=\"Select\",0))))","v":0},{"$f":"IF(AND(B13=\"Piedmont\",I13>0.0001,I13<0.1),0.41, IF(AND(B13=\"Piedmont\",I13>10), 2.45, IF(B13=\"Piedmont\",I13^0.39, IF(AND(B13=\"Coastal Plain\",I13>0.0001,I13<0.1),0.42,IF(AND(B13=\"Coastal Plain\",I13>10),2.4, IF(B13=\"Coastal Plain\",I13^0.38, IF(AND(B13=\"Mountain\",I13>0.0001,I13<0.1),0.36,IF(AND(B13=\"Mountain\",I13>10),2.75,IF(B13=\"Mountain\",I13^0.44)))))))))","v":false},null,null,{"$f":"IF(AND(H11=\"Primary\",L11=\"Length Loss\"), L12*G11*I12*L13*-1,IF(AND(H11=\"Primary\", L11=\"Length Gain\"),L12*G13*I14*L13*-1,0))","v":0}]
[null,"Not Selected","Existing","Preliminary Resource Evaluation","Select",null,null,"Select",null,{"$f":"IF(H15=\"Second\",(F15*G15*H16*1), IF(H15=\"Third\",(F15*G15*H16*1), (F15*G15*H16*I16)))","v":0},{"$f":" J17-J15","v":0},{"$f":"IF(F15>F17, \"Length Loss\", IF(F15<F17, \"Length Gain\", IF(F15=F17, \"No Change\")))","v":"Length Gain"},0,"Existing: Select From Dropdown","Proposed: Select From Dropdown",{"$f":"IF(D17=\"Restoration/Enhancement\",SUM(K15,L18,M17,N17),IF(D17=\"Preservation\",((0.1*J17)+M17+N17),\"NA\"))","v":"NA"}]
[null,null,null,null,null,null,null,{"$f":"IF(H15=\"Primary\",1,IF(H15=\"Second\",0.2,IF(H15=\"Third\",0.1,IF(H15=\"Select\",0))))","v":0},{"$f":"IF(AND(B15=\"Piedmont\",I15>0.0001,I15<0.1),0.41, IF(AND(B15=\"Piedmont\",I15>10), 2.45, IF(B15=\"Piedmont\",I15^0.39, IF(AND(B15=\"Coastal Plain\",I15>0.0001,I15<0.1),0.42,IF(AND(B15=\"Coastal Plain\",I15>10),2.4, IF(B15=\"Coastal Plain\",I15^0.38, IF(AND(B15=\"Mountain\",I15>0.0001,I15<0.1),0.36,IF(AND(B15=\"Mountain\",I15>10),2.75,IF(B15=\"Mountain\",I15^0.44)))))))))","v":false},null,null,{"$f":"F17-F15","v":325},null,{"$f":"IF(AND(N15=\"No Existing Protection\",O15=\"Deed Restriction\"), 0.02, IF(AND(N15=\"No Existing Protection\",O15=\"Easement\"), 0.05, IF(AND(N15=\"No Existing Protection\", O15=\"Accredited Easement\"), 0.07, IF(AND(N15=\"No Existing Protection\", O15=\"Fee Simple to Conservation Holder\"), 0.09, IF(AND(N15=\"Agricultural Easement\",O15=\"Deed Restriction\"), 0.01, IF(AND(N15=\"Agricultural Easement\",O15=\"Easement\"), 0.04, IF(AND(N15=\"Agricultural Easement\", O15=\"Accredited Easement\"), 0.06, IF(AND(N15=\"Agricultural Easement\", O15=\"Fee Simple to Conservation Holder\"), 0.09, IF(AND(N15=\"Environmental Easement\",O15=\"Deed Restriction\"), 0, IF(AND(N15=\"Environmental Easement\", O15=\"Easement\"), 0.02, IF(AND(N15=\"Environmental Easement\", O15=\"Accredited Easement\"), 0.03, IF(AND(N15=\"Public Land\", O15=\"Public Land MOA\"), 0.02, 0))))))))))))","v":0}]
[null,{"$f":"B15","v":"Not Selected"},"Proposed","Select from Dropdown","Select",325,null,{"$f":"H15","v":"Select"},{"$f":"I15","v":0},{"$f":"IF(H17=\"Second\",(F17*G17*H18*1), IF(H17=\"Third\",(F17*G17*H18*1), (F17*G17*H18*I18)))","v":0},null,0.5,{"$f":"IF(D17=\"Preservation\",((J17*0.1)*M15),(K15+L18)*M15)","v":0},{"$f":"IF(H15=\"Second\",(J17*N16),IF(H15=\"Third\",(J17*N16),(J17/I18*N16)))","v":{"$error":"#DIV/0!"}}]
[null,null,null,null,null,null,null,{"$f":"IF(H17=\"Primary\",1,IF(H17=\"Second\",0.2,IF(H17=\"Third\",0.1,IF(H17=\"Select\",0))))","v":0},{"$f":"IF(AND(B17=\"Piedmont\",I17>0.0001,I17<0.1),0.41, IF(AND(B17=\"Piedmont\",I17>10), 2.45, IF(B17=\"Piedmont\",I17^0.39, IF(AND(B17=\"Coastal Plain\",I17>0.0001,I17<0.1),0.42,IF(AND(B17=\"Coastal Plain\",I17>10),2.4, IF(B17=\"Coastal Plain\",I17^0.38, IF(AND(B17=\"Mountain\",I17>0.0001,I17<0.1),0.36,IF(AND(B17=\"Mountain\",I17>10),2.75,IF(B17=\"Mountain\",I17^0.44)))))))))","v":false},null,null,{"$f":"IF(AND(H15=\"Primary\",L15=\"Length Loss\"), L16*G15*I16*L17*-1,IF(AND(H15=\"Primary\", L15=\"Length Gain\"),L16*G17*I18*L17*-1,0))","v":0}]
[null,"Not Selected","Existing","Preliminary Resource Evaluation","Select",null,null,"Select",null,{"$f":"IF(H19=\"Second\",(F19*G19*H20*1), IF(H19=\"Third\",(F19*G19*H20*1), (F19*G19*H20*I20)))","v":0},{"$f":" J21-J19","v":0},{"$f":"IF(F19>F21, \"Length Loss\", IF(F19<F21, \"Length Gain\", IF(F19=F21, \"No Change\")))","v":"No Change"},0,"Existing: Select From Dropdown","Proposed: Select From Dropdown",{"$f":"IF(D21=\"Restoration/Enhancement\",SUM(K19,L22,M21,N21),IF(D21=\"Preservation\",((0.1*J21)+M21+N21),\"NA\"))","v":"NA"}]
[null,null,null,null,null,null,null,{"$f":"IF(H19=\"Primary\",1,IF(H19=\"Second\",0.2,IF(H19=\"Third\",0.1,IF(H19=\"Select\",0))))","v":0},{"$f":"IF(AND(B19=\"Piedmont\",I19>0.0001,I19<0.1),0.41, IF(AND(B19=\"Piedmont\",I19>10), 2.45, IF(B19=\"Piedmont\",I19^0.39, IF(AND(B19=\"Coastal Plain\",I19>0.0001,I19<0.1),0.42,IF(AND(B19=\"Coastal Plain\",I19>10),2.4, IF(B19=\"Coastal Plain\",I19^0.38, IF(AND(B19=\"Mountain\",I19>0.0001,I19<0.1),0.36,IF(AND(B19=\"Mountain\",I19>10),2.75,IF(B19=\"Mountain\",I19^0.44)))))))))","v":false},null,null,{"$f":"F21-F19","v":0},null,{"$f":"IF(AND(N19=\"No Existing Protection\",O19=\"Deed Restriction\"), 0.02, IF(AND(N19=\"No Existing Protection\",O19=\"Easement\"), 0.05, IF(AND(N19=\"No Existing Protection\", O19=\"Accredited Easement\"), 0.07, IF(AND(N19=\"No Existing Protection\", O19=\"Fee Simple to Conservation Holder\"), 0.09, IF(AND(N19=\"Agricultural Easement\",O19=\"Deed Restriction\"), 0.01, IF(AND(N19=\"Agricultural Easement\",O19=\"Easement\"), 0.04, IF(AND(N19=\"Agricultural Easement\", O19=\"Accredited Easement\"), 0.06, IF(AND(N19=\"Agricultural Easement\", O19=\"Fee Simple to Conservation Holder\"), 0.09, IF(AND(N19=\"Environmental Easement\",O19=\"Deed Restriction\"), 0, IF(AND(N19=\"Environmental Easement\", O19=\"Easement\"), 0.02, IF(AND(N19=\"Environmental Easement\", O19=\"Accredited Easement\"), 0.03, IF(AND(N19=\"Public Land\", O19=\"Public Land MOA\"), 0.02, 0))))))))))))","v":0}]
[null,{"$f":"B19","v":"Not Selected"},"Proposed","Select from Dropdown","Select",null,null,{"$f":"H19","v":"Select"},{"$f":"I19","v":0},{"$f":"IF(H21=\"Second\",(F21*G21*H22*1), IF(H21=\"Third\",(F21*G21*H22*1), (F21*G21*H22*I22)))","v":0},null,0.5,{"$f":"IF(D21=\"Preservation\",((J21*0.1)*M19),(K19+L22)*M19)","v":0},{"$f":"IF(H19=\"Second\",(J21*N20),IF(H19=\"Third\",(J21*N20),(J21/I22*N20)))","v":{"$error":"#DIV/0!"}}]
[null,null,null,null,null,null,null,{"$f":"IF(H21=\"Primary\",1,IF(H21=\"Second\",0.2,IF(H21=\"Third\",0.1,IF(H21=\"Select\",0))))","v":0},{"$f":"IF(AND(B21=\"Piedmont\",I21>0.0001,I21<0.1),0.41, IF(AND(B21=\"Piedmont\",I21>10), 2.45, IF(B21=\"Piedmont\",I21^0.39, IF(AND(B21=\"Coastal Plain\",I21>0.0001,I21<0.1),0.42,IF(AND(B21=\"Coastal Plain\",I21>10),2.4, IF(B21=\"Coastal Plain\",I21^0.38, IF(AND(B21=\"Mountain\",I21>0.0001,I21<0.1),0.36,IF(AND(B21=\"Mountain\",I21>10),2.75,IF(B21=\"Mountain\",I21^0.44)))))))))","v":false},null,null,{"$f":"IF(AND(H19=\"Primary\",L19=\"Length Loss\"), L20*G19*I20*L21*-1,IF(AND(H19=\"Primary\", L19=\"Length Gain\"),L20*G21*I22*L21*-1,0))","v":0}]
[null,"Not Selected","Existing","Preliminary Resource Evaluation","Select",null,null,"Select",null,{"$f":"IF(H23=\"Second\",(F23*G23*H24*1), IF(H23=\"Third\",(F23*G23*H24*1), (F23*G23*H24*I24)))","v":0},{"$f":" J25-J23","v":0},{"$f":"IF(F23>F25, \"Length Loss\", IF(F23<F25, \"Length Gain\", IF(F23=F25, \"No Change\")))","v":"No Change"},0,"Existing: Select From Dropdown","Proposed: Select From Dropdown",{"$f":"IF(D25=\"Restoration/Enhancement\",SUM(K23,L26,M25,N25),IF(D25=\"Preservation\",((0.1*J25)+M25+N25),\"NA\"))","v":"NA"}]
[null,null,null,null,null,null,null,{"$f":"IF(H23=\"Primary\",1,IF(H23=\"Second\",0.2,IF(H23=\"Third\",0.1,IF(H23=\"Select\",0))))","v":0},{"$f":"IF(AND(B23=\"Piedmont\",I23>0.0001,I23<0.1),0.41, IF(AND(B23=\"Piedmont\",I23>10), 2.45, IF(B23=\"Piedmont\",I23^0.39, IF(AND(B23=\"Coastal Plain\",I23>0.0001,I23<0.1),0.42,IF(AND(B23=\"Coastal Plain\",I23>10),2.4, IF(B23=\"Coastal Plain\",I23^0.38, IF(AND(B23=\"Mountain\",I23>0.0001,I23<0.1),0.36,IF(AND(B23=\"Mountain\",I23>10),2.75,IF(B23=\"Mountain\",I23^0.44)))))))))","v":false},null,null,{"$f":"F25-F23","v":0},null,{"$f":"IF(AND(N23=\"No Existing Protection\",O23=\"Deed Restriction\"), 0.02, IF(AND(N23=\"No Existing Protection\",O23=\"Easement\"), 0.05, IF(AND(N23=\"No Existing Protection\", O23=\"Accredited Easement\"), 0.07, IF(AND(N23=\"No Existing Protection\", O23=\"Fee Simple to Conservation Holder\"), 0.09, IF(AND(N23=\"Agricultural Easement\",O23=\"Deed Restriction\"), 0.01, IF(AND(N23=\"Agricultural Easement\",O23=\"Easement\"), 0.04, IF(AND(N23=\"Agricultural Easement\", O23=\"Accredited Easement\"), 0.06, IF(AND(N23=\"Agricultural Easement\", O23=\"Fee Simple to Conservation Holder\"), 0.09, IF(AND(N23=\"Environmental Easement\",O23=\"Deed Restriction\"), 0, IF(AND(N23=\"Environmental Easement\", O23=\"Easement\"), 0.02, IF(AND(N23=\"Environmental Easement\", O23=\"Accredited Easement\"), 0.03, IF(AND(N23=\"Public Land\", O23=\"Public Land MOA\"), 0.02, 0))))))))))))","v":0}]
[null,{"$f":"B23","v":"Not Selected"},"Proposed","Select from Dropdown","Select",null,null,{"$f":"H23","v":"Select"},{"$f":"I23","v":0},{"$f":"IF(H25=\"Second\",(F25*G25*H26*1), IF(H25=\"Third\",(F25*G25*H26*1), (F25*G25*H26*I26)))","v":0},null,0.5,{"$f":"IF(D25=\"Preservation\",((J25*0.1)*M23),(K23+L26)*M23)","v":0},{"$f":"IF(H23=\"Second\",(J25*N24),IF(H23=\"Third\",(J25*N24),(J25/I26*N24)))","v":{"$error":"#DIV/0!"}}]
[null,null,null,null,null,null,null,{"$f":"IF(H25=\"Primary\",1,IF(H25=\"Second\",0.2,IF(H25=\"Third\",0.1,IF(H25=\"Select\",0))))","v":0},{"$f":"IF(AND(B25=\"Piedmont\",I25>0.0001,I25<0.1),0.41, IF(AND(B25=\"Piedmont\",I25>10), 2.45, IF(B25=\"Piedmont\",I25^0.39, IF(AND(B25=\"Coastal Plain\",I25>0.0001,I25<0.1),0.42,IF(AND(B25=\"Coastal Plain\",I25>10),2.4, IF(B25=\"Coastal Plain\",I25^0.38, IF(AND(B25=\"Mountain\",I25>0.0001,I25<0.1),0.36,IF(AND(B25=\"Mountain\",I25>10),2.75,IF(B25=\"Mountain\",I25^0.44)))))))))","v":false},null,null,{"$f":"IF(AND(H23=\"Primary\",L23=\"Length Loss\"), L24*G23*I24*L25*-1,IF(AND(H23=\"Primary\", L23=\"Length Gain\"),L24*G25*I26*L25*-1,0))","v":0}]
[null,"Not Selected","Existing","Preliminary Resource Evaluation","Select",null,null,"Select",null,{"$f":"IF(H27=\"Second\",(F27*G27*H28*1), IF(H27=\"Third\",(F27*G27*H28*1), (F27*G27*H28*I28)))","v":0},{"$f":" J29-J27","v":0},{"$f":"IF(F27>F29, \"Length Loss\", IF(F27<F29, \"Length Gain\", IF(F27=F29, \"No Change\")))","v":"No Change"},0,"Existing: Select From Dropdown","Proposed: Select From Dropdown",{"$f":"IF(D29=\"Restoration/Enhancement\",SUM(K27,L30,M29,N29),IF(D29=\"Preservation\",((0.1*J29)+M29+N29),\"NA\"))","v":"NA"}]
[null,null,null,null,null,null,null,{"$f":"IF(H27=\"Primary\",1,IF(H27=\"Second\",0.2,IF(H27=\"Third\",0.1,IF(H27=\"Select\",0))))","v":0},{"$f":"IF(AND(B27=\"Piedmont\",I27>0.0001,I27<0.1),0.41, IF(AND(B27=\"Piedmont\",I27>10), 2.45, IF(B27=\"Piedmont\",I27^0.39, IF(AND(B27=\"Coastal Plain\",I27>0.0001,I27<0.1),0.42,IF(AND(B27=\"Coastal Plain\",I27>10),2.4, IF(B27=\"Coastal Plain\",I27^0.38, IF(AND(B27=\"Mountain\",I27>0.0001,I27<0.1),0.36,IF(AND(B27=\"Mountain\",I27>10),2.75,IF(B27=\"Mountain\",I27^0.44)))))))))","v":false},null,null,{"$f":"F29-F27","v":0},null,{"$f":"IF(AND(N27=\"No Existing Protection\",O27=\"Deed Restriction\"), 0.02, IF(AND(N27=\"No Existing Protection\",O27=\"Easement\"), 0.05, IF(AND(N27=\"No Existing Protection\", O27=\"Accredited Easement\"), 0.07, IF(AND(N27=\"No Existing Protection\", O27=\"Fee Simple to Conservation Holder\"), 0.09, IF(AND(N27=\"Agricultural Easement\",O27=\"Deed Restriction\"), 0.01, IF(AND(N27=\"Agricultural Easement\",O27=\"Easement\"), 0.04, IF(AND(N27=\"Agricultural Easement\", O27=\"Accredited Easement\"), 0.06, IF(AND(N27=\"Agricultural Easement\", O27=\"Fee Simple to Conservation Holder\"), 0.09, IF(AND(N27=\"Environmental Easement\",O27=\"Deed Restriction\"), 0, IF(AND(N27=\"Environmental Easement\", O27=\"Easement\"), 0.02, IF(AND(N27=\"Environmental Easement\", O27=\"Accredited Easement\"), 0.03, IF(AND(N27=\"Public Land\", O27=\"Public Land MOA\"), 0.02, 0))))))))))))","v":0}]
[null,{"$f":"B27","v":"Not Selected"},"Proposed","Select from Dropdown","Select",null,null,{"$f":"H27","v":"Select"},0,{"$f":"IF(H29=\"Second\",(F29*G29*H30*1), IF(H29=\"Third\",(F29*G29*H30*1), (F29*G29*H30*I30)))","v":0},null,0.5,{"$f":"IF(D29=\"Preservation\",((J29*0.1)*M27),(K27+L30)*M27)","v":0},{"$f":"IF(H27=\"Second\",(J29*N28),IF(H27=\"Third\",(J29*N28),(J29/I30*N28)))","v":{"$error":"#DIV/0!"}}]
[null,null,null,null,null,null,null,{"$f":"IF(H29=\"Primary\",1,IF(H29=\"Second\",0.2,IF(H29=\"Third\",0.1,IF(H29=\"Select\",0))))","v":0},{"$f":"IF(AND(B29=\"Piedmont\",I29>0.0001,I29<0.1),0.41, IF(AND(B29=\"Piedmont\",I29>10), 2.45, IF(B29=\"Piedmont\",I29^0.39, IF(AND(B29=\"Coastal Plain\",I29>0.0001,I29<0.1),0.42,IF(AND(B29=\"Coastal Plain\",I29>10),2.4, IF(B29=\"Coastal Plain\",I29^0.38, IF(AND(B29=\"Mountain\",I29>0.0001,I29<0.1),0.36,IF(AND(B29=\"Mountain\",I29>10),2.75,IF(B29=\"Mountain\",I29^0.44)))))))))","v":false},null,null,{"$f":"IF(AND(H27=\"Primary\",L27=\"Length Loss\"), L28*G27*I28*L29*-1,IF(AND(H27=\"Primary\", L27=\"Length Gain\"),L28*G29*I30*L29*-1,0))","v":0}]
[null,"Not Selected","Existing","Preliminary Resource Evaluation","Select",null,null,"Select",null,{"$f":"IF(H31=\"Second\",(F31*G31*H32*1), IF(H31=\"Third\",(F31*G31*H32*1), (F31*G31*H32*I32)))","v":0},{"$f":" J33-J31","v":0},{"$f":"IF(F31>F33, \"Length Loss\", IF(F31<F33, \"Length Gain\", IF(F31=F33, \"No Change\")))","v":"No Change"},0,"Existing: Select From Dropdown","Proposed: Select From Dropdown",{"$f":"IF(D33=\"Restoration/Enhancement\",SUM(K31,L34,M33,N33),IF(D33=\"Preservation\",((0.1*J33)+M33+N33),\"NA\"))","v":"NA"}]
[null,null,null,null,null,null,null,{"$f":"IF(H31=\"Primary\",1,IF(H31=\"Second\",0.2,IF(H31=\"Third\",0.1,IF(H31=\"Select\",0))))","v":0},{"$f":"IF(AND(B31=\"Piedmont\",I31>0.0001,I31<0.1),0.41, IF(AND(B31=\"Piedmont\",I31>10), 2.45, IF(B31=\"Piedmont\",I31^0.39, IF(AND(B31=\"Coastal Plain\",I31>0.0001,I31<0.1),0.42,IF(AND(B31=\"Coastal Plain\",I31>10),2.4, IF(B31=\"Coastal Plain\",I31^0.38, IF(AND(B31=\"Mountain\",I31>0.0001,I31<0.1),0.36,IF(AND(B31=\"Mountain\",I31>10),2.75,IF(B31=\"Mountain\",I31^0.44)))))))))","v":false},null,null,{"$f":"F33-F31","v":0},null,{"$f":"IF(AND(N31=\"No Existing Protection\",O31=\"Deed Restriction\"), 0.02, IF(AND(N31=\"No Existing Protection\",O31=\"Easement\"), 0.05, IF(AND(N31=\"No Existing Protection\", O31=\"Accredited Easement\"), 0.07, IF(AND(N31=\"No Existing Protection\", O31=\"Fee Simple to Conservation Holder\"), 0.09, IF(AND(N31=\"Agricultural Easement\",O31=\"Deed Restriction\"), 0.01, IF(AND(N31=\"Agricultural Easement\",O31=\"Easement\"), 0.04, IF(AND(N31=\"Agricultural Easement\", O31=\"Accredited Easement\"), 0.06, IF(AND(N31=\"Agricultural Easement\", O31=\"Fee Simple to Conservation Holder\"), 0.09, IF(AND(N31=\"Environmental Easement\",O31=\"Deed Restriction\"), 0, IF(AND(N31=\"Environmental Easement\", O31=\"Easement\"), 0.02, IF(AND(N31=\"Environmental Easement\", O31=\"Accredited Easement\"), 0.03, IF(AND(N31=\"Public Land\", O31=\"Public Land MOA\"), 0.02, 0))))))))))))","v":0}]
[null,{"$f":"B31","v":"Not Selected"},"Proposed","Select from Dropdown","Select",null,null,{"$f":"H31","v":"Select"},0,{"$f":"IF(H33=\"Second\",(F33*G33*H34*1), IF(H33=\"Third\",(F33*G33*H34*1), (F33*G33*H34*I34)))","v":0},null,0.5,{"$f":"IF(D33=\"Preservation\",((J33*0.1)*M31),(K31+L34)*M31)","v":0},{"$f":"IF(H31=\"Second\",(J33*N32),IF(H31=\"Third\",(J33*N32),(J33/I34*N32)))","v":{"$error":"#DIV/0!"}}]
[null,null,null,null,null,null,null,{"$f":"IF(H33=\"Primary\",1,IF(H33=\"Second\",0.2,IF(H33=\"Third\",0.1,IF(H33=\"Select\",0))))","v":0},{"$f":"IF(AND(B33=\"Piedmont\",I33>0.0001,I33<0.1),0.41, IF(AND(B33=\"Piedmont\",I33>10), 2.45, IF(B33=\"Piedmont\",I33^0.39, IF(AND(B33=\"Coastal Plain\",I33>0.0001,I33<0.1),0.42,IF(AND(B33=\"Coastal Plain\",I33>10),2.4, IF(B33=\"Coastal Plain\",I33^0.38, IF(AND(B33=\"Mountain\",I33>0.0001,I33<0.1),0.36,IF(AND(B33=\"Mountain\",I33>10),2.75,IF(B33=\"Mountain\",I33^0.44)))))))))","v":false},null,null,{"$f":"IF(AND(H31=\"Primary\",L31=\"Length Loss\"), L32*G31*I32*L33*-1,IF(AND(H31=\"Primary\", L31=\"Length Gain\"),L32*G33*I34*L33*-1,0))","v":0}]
[null,"Not Selected","Existing","Preliminary Resource Evaluation","Select",null,null,"Select",null,{"$f":"IF(H35=\"Second\",(F35*G35*H36*1), IF(H35=\"Third\",(F35*G35*H36*1), (F35*G35*H36*I36)))","v":0},{"$f":" J37-J35","v":0},{"$f":"IF(F35>F37, \"Length Loss\", IF(F35<F37, \"Length Gain\", IF(F35=F37, \"No Change\")))","v":"No Change"},0,"Existing: Select From Dropdown","Proposed: Select From Dropdown",{"$f":"IF(D37=\"Restoration/Enhancement\",SUM(K35,L38,M37,N37),IF(D37=\"Preservation\",((0.1*J37)+M37+N37),\"NA\"))","v":"NA"}]
[null,null,null,null,null,null,null,{"$f":"IF(H35=\"Primary\",1,IF(H35=\"Second\",0.2,IF(H35=\"Third\",0.1,IF(H35=\"Select\",0))))","v":0},{"$f":"IF(AND(B35=\"Piedmont\",I35>0.0001,I35<0.1),0.41, IF(AND(B35=\"Piedmont\",I35>10), 2.45, IF(B35=\"Piedmont\",I35^0.39, IF(AND(B35=\"Coastal Plain\",I35>0.0001,I35<0.1),0.42,IF(AND(B35=\"Coastal Plain\",I35>10),2.4, IF(B35=\"Coastal Plain\",I35^0.38, IF(AND(B35=\"Mountain\",I35>0.0001,I35<0.1),0.36,IF(AND(B35=\"Mountain\",I35>10),2.75,IF(B35=\"Mountain\",I35^0.44)))))))))","v":false},null,null,{"$f":"F37-F35","v":0},null,{"$f":"IF(AND(N35=\"No Existing Protection\",O35=\"Deed Restriction\"), 0.02, IF(AND(N35=\"No Existing Protection\",O35=\"Easement\"), 0.05, IF(AND(N35=\"No Existing Protection\", O35=\"Accredited Easement\"), 0.07, IF(AND(N35=\"No Existing Protection\", O35=\"Fee Simple to Conservation Holder\"), 0.09, IF(AND(N35=\"Agricultural Easement\",O35=\"Deed Restriction\"), 0.01, IF(AND(N35=\"Agricultural Easement\",O35=\"Easement\"), 0.04, IF(AND(N35=\"Agricultural Easement\", O35=\"Accredited Easement\"), 0.06, IF(AND(N35=\"Agricultural Easement\", O35=\"Fee Simple to Conservation Holder\"), 0.09, IF(AND(N35=\"Environmental Easement\",O35=\"Deed Restriction\"), 0, IF(AND(N35=\"Environmental Easement\", O35=\"Easement\"), 0.02, IF(AND(N35=\"Environmental Easement\", O35=\"Accredited Easement\"), 0.03, IF(AND(N35=\"Public Land\", O35=\"Public Land MOA\"), 0.02, 0))))))))))))","v":0}]
[null,{"$f":"B35","v":"Not Selected"},"Proposed","Select from Dropdown","Select",null,null,{"$f":"H35","v":"Select"},0,{"$f":"IF(H37=\"Second\",(F37*G37*H38*1), IF(H37=\"Third\",(F37*G37*H38*1), (F37*G37*H38*I38)))","v":0},null,0.5,{"$f":"IF(D37=\"Preservation\",((J37*0.1)*M35),(K35+L38)*M35)","v":0},{"$f":"IF(H35=\"Second\",(J37*N36),IF(H35=\"Third\",(J37*N36),(J37/I38*N36)))","v":{"$error":"#DIV/0!"}}]
[null,null,null,null,null,null,null,{"$f":"IF(H37=\"Primary\",1,IF(H37=\"Second\",0.2,IF(H37=\"Third\",0.1,IF(H37=\"Select\",0))))","v":0},{"$f":"IF(AND(B37=\"Piedmont\",I37>0.0001,I37<0.1),0.41, IF(AND(B37=\"Piedmont\",I37>10), 2.45, IF(B37=\"Piedmont\",I37^0.39, IF(AND(B37=\"Coastal Plain\",I37>0.0001,I37<0.1),0.42,IF(AND(B37=\"Coastal Plain\",I37>10),2.4, IF(B37=\"Coastal Plain\",I37^0.38, IF(AND(B37=\"Mountain\",I37>0.0001,I37<0.1),0.36,IF(AND(B37=\"Mountain\",I37>10),2.75,IF(B37=\"Mountain\",I37^0.44)))))))))","v":false},null,null,{"$f":"IF(AND(H35=\"Primary\",L35=\"Length Loss\"), L36*G35*I36*L37*-1,IF(AND(H35=\"Primary\", L35=\"Length Gain\"),L36*G37*I38*L37*-1,0))","v":0}]
[null,"Not Selected","Existing","Preliminary Resource Evaluation","Select",null,null,"Select",null,{"$f":"IF(H39=\"Second\",(F39*G39*H40*1), IF(H39=\"Third\",(F39*G39*H40*1), (F39*G39*H40*I40)))","v":0},{"$f":" J41-J39","v":0},{"$f":"IF(F39>F41, \"Length Loss\", IF(F39<F41, \"Length Gain\", IF(F39=F41, \"No Change\")))","v":"No Change"},0,"Existing: Select From Dropdown","Proposed: Select From Dropdown",{"$f":"IF(D41=\"Restoration/Enhancement\",SUM(K39,L42,M41,N41),IF(D41=\"Preservation\",((0.1*J41)+M41+N41),\"NA\"))","v":"NA"}]
[null,null,null,null,null,null,null,{"$f":"IF(H39=\"Primary\",1,IF(H39=\"Second\",0.2,IF(H39=\"Third\",0.1,IF(H39=\"Select\",0))))","v":0},{"$f":"IF(AND(B39=\"Piedmont\",I39>0.0001,I39<0.1),0.41, IF(AND(B39=\"Piedmont\",I39>10), 2.45, IF(B39=\"Piedmont\",I39^0.39, IF(AND(B39=\"Coastal Plain\",I39>0.0001,I39<0.1),0.42,IF(AND(B39=\"Coastal Plain\",I39>10),2.4, IF(B39=\"Coastal Plain\",I39^0.38, IF(AND(B39=\"Mountain\",I39>0.0001,I39<0.1),0.36,IF(AND(B39=\"Mountain\",I39>10),2.75,IF(B39=\"Mountain\",I39^0.44)))))))))","v":false},null,null,{"$f":"F41-F39","v":0},null,{"$f":"IF(AND(N39=\"No Existing Protection\",O39=\"Deed Restriction\"), 0.02, IF(AND(N39=\"No Existing Protection\",O39=\"Easement\"), 0.05, IF(AND(N39=\"No Existing Protection\", O39=\"Accredited Easement\"), 0.07, IF(AND(N39=\"No Existing Protection\", O39=\"Fee Simple to Conservation Holder\"), 0.09, IF(AND(N39=\"Agricultural Easement\",O39=\"Deed Restriction\"), 0.01, IF(AND(N39=\"Agricultural Easement\",O39=\"Easement\"), 0.04, IF(AND(N39=\"Agricultural Easement\", O39=\"Accredited Easement\"), 0.06, IF(AND(N39=\"Agricultural Easement\", O39=\"Fee Simple to Conservation Holder\"), 0.09, IF(AND(N39=\"Environmental Easement\",O39=\"Deed Restriction\"), 0, IF(AND(N39=\"Environmental Easement\", O39=\"Easement\"), 0.02, IF(AND(N39=\"Environmental Easement\", O39=\"Accredited Easement\"), 0.03, IF(AND(N39=\"Public Land\", O39=\"Public Land MOA\"), 0.02, 0))))))))))))","v":0}]
[null,{"$f":"B39","v":"Not Selected"},"Proposed","Select from Dropdown","Select",null,null,{"$f":"H39","v":"Select"},0,{"$f":"IF(H41=\"Second\",(F41*G41*H42*1), IF(H41=\"Third\",(F41*G41*H42*1), (F41*G41*H42*I42)))","v":0},null,0.5,{"$f":"IF(D41=\"Preservation\",((J41*0.1)*M39),(K39+L42)*M39)","v":0},{"$f":"IF(H39=\"Second\",(J41*N40),IF(H39=\"Third\",(J41*N40),(J41/I42*N40)))","v":{"$error":"#DIV/0!"}}]
[null,null,null,null,null,null,null,{"$f":"IF(H41=\"Primary\",1,IF(H41=\"Second\",0.2,IF(H41=\"Third\",0.1,IF(H41=\"Select\",0))))","v":0},{"$f":"IF(AND(B41=\"Piedmont\",I41>0.0001,I41<0.1),0.41, IF(AND(B41=\"Piedmont\",I41>10), 2.45, IF(B41=\"Piedmont\",I41^0.39, IF(AND(B41=\"Coastal Plain\",I41>0.0001,I41<0.1),0.42,IF(AND(B41=\"Coastal Plain\",I41>10),2.4, IF(B41=\"Coastal Plain\",I41^0.38, IF(AND(B41=\"Mountain\",I41>0.0001,I41<0.1),0.36,IF(AND(B41=\"Mountain\",I41>10),2.75,IF(B41=\"Mountain\",I41^0.44)))))))))","v":false},null,null,{"$f":"IF(AND(H39=\"Primary\",L39=\"Length Loss\"), L40*G39*I40*L41*-1,IF(AND(H39=\"Primary\", L39=\"Length Gain\"),L40*G41*I42*L41*-1,0))","v":0}]
[null,"Not Selected","Existing","Preliminary Resource Evaluation","Select",null,null,"Select",null,{"$f":"IF(H43=\"Second\",(F43*G43*H44*1), IF(H43=\"Third\",(F43*G43*H44*1), (F43*G43*H44*I44)))","v":0},{"$f":" J45-J43","v":0},{"$f":"IF(F43>F45, \"Length Loss\", IF(F43<F45, \"Length Gain\", IF(F43=F45, \"No Change\")))","v":"No Change"},0,"Existing: Select From Dropdown","Proposed: Select From Dropdown",{"$f":"IF(D45=\"Restoration/Enhancement\",SUM(K43,L46,M45,N45),IF(D45=\"Preservation\",((0.1*J45)+M45+N45),\"NA\"))","v":"NA"}]
[null,null,null,null,null,null,null,{"$f":"IF(H43=\"Primary\",1,IF(H43=\"Second\",0.2,IF(H43=\"Third\",0.1,IF(H43=\"Select\",0))))","v":0},{"$f":"IF(AND(B43=\"Piedmont\",I43>0.0001,I43<0.1),0.41, IF(AND(B43=\"Piedmont\",I43>10), 2.45, IF(B43=\"Piedmont\",I43^0.39, IF(AND(B43=\"Coastal Plain\",I43>0.0001,I43<0.1),0.42,IF(AND(B43=\"Coastal Plain\",I43>10),2.4, IF(B43=\"Coastal Plain\",I43^0.38, IF(AND(B43=\"Mountain\",I43>0.0001,I43<0.1),0.36,IF(AND(B43=\"Mountain\",I43>10),2.75,IF(B43=\"Mountain\",I43^0.44)))))))))","v":false},null,null,{"$f":"F45-F43","v":0},null,{"$f":"IF(AND(N43=\"No Existing Protection\",O43=\"Deed Restriction\"), 0.02, IF(AND(N43=\"No Existing Protection\",O43=\"Easement\"), 0.05, IF(AND(N43=\"No Existing Protection\", O43=\"Accredited Easement\"), 0.07, IF(AND(N43=\"No Existing Protection\", O43=\"Fee Simple to Conservation Holder\"), 0.09, IF(AND(N43=\"Agricultural Easement\",O43=\"Deed Restriction\"), 0.01, IF(AND(N43=\"Agricultural Easement\",O43=\"Easement\"), 0.04, IF(AND(N43=\"Agricultural Easement\", O43=\"Accredited Easement\"), 0.06, IF(AND(N43=\"Agricultural Easement\", O43=\"Fee Simple to Conservation Holder\"), 0.09, IF(AND(N43=\"Environmental Easement\",O43=\"Deed Restriction\"), 0, IF(AND(N43=\"Environmental Easement\", O43=\"Easement\"), 0.02, IF(AND(N43=\"Environmental Easement\", O43=\"Accredited Easement\"), 0.03, IF(AND(N43=\"Public Land\", O43=\"Public Land MOA\"), 0.02, 0))))))))))))","v":0}]
[null,{"$f":"B43","v":"Not Selected"},"Proposed","Select from Dropdown","Select",null,null,{"$f":"H43","v":"Select"},0,{"$f":"IF(H45=\"Second\",(F45*G45*H46*1), IF(H45=\"Third\",(F45*G45*H46*1), (F45*G45*H46*I46)))","v":0},null,0.5,{"$f":"IF(D45=\"Preservation\",((J45*0.1)*M43),(K43+L46)*M43)","v":0},{"$f":"IF(H43=\"Second\",(J45*N44),IF(H43=\"Third\",(J45*N44),(J45/I46*N44)))","v":{"$error":"#DIV/0!"}}]
[null,null,null,null,null,null,null,{"$f":"IF(H45=\"Primary\",1,IF(H45=\"Second\",0.2,IF(H45=\"Third\",0.1,IF(H45=\"Select\",0))))","v":0},{"$f":"IF(AND(B45=\"Piedmont\",I45>0.0001,I45<0.1),0.41, IF(AND(B45=\"Piedmont\",I45>10), 2.45, IF(B45=\"Piedmont\",I45^0.39, IF(AND(B45=\"Coastal Plain\",I45>0.0001,I45<0.1),0.42,IF(AND(B45=\"Coastal Plain\",I45>10),2.4, IF(B45=\"Coastal Plain\",I45^0.38, IF(AND(B45=\"Mountain\",I45>0.0001,I45<0.1),0.36,IF(AND(B45=\"Mountain\",I45>10),2.75,IF(B45=\"Mountain\",I45^0.44)))))))))","v":false},null,null,{"$f":"IF(AND(H43=\"Primary\",L43=\"Length Loss\"), L44*G43*I44*L45*-1,IF(AND(H43=\"Primary\", L43=\"Length Gain\"),L44*G45*I46*L45*-1,0))","v":0}]
[null,"Not Selected","Existing","Preliminary Resource Evaluation","Select",null,null,"Select",null,{"$f":"IF(H47=\"Second\",(F47*G47*H48*1), IF(H47=\"Third\",(F47*G47*H48*1), (F47*G47*H48*I48)))","v":0},{"$f":" J49-J47","v":0},{"$f":"IF(F47>F49, \"Length Loss\", IF(F47<F49, \"Length Gain\", IF(F47=F49, \"No Change\")))","v":"No Change"},0,"Existing: Select From Dropdown","Proposed: Select From Dropdown",{"$f":"IF(D49=\"Restoration/Enhancement\",SUM(K47,L50,M49,N49),IF(D49=\"Preservation\",((0.1*J49)+M49+N49),\"NA\"))","v":"NA"}]
[null,null,null,null,null,null,null,{"$f":"IF(H47=\"Primary\",1,IF(H47=\"Second\",0.2,IF(H47=\"Third\",0.1,IF(H47=\"Select\",0))))","v":0},{"$f":"IF(AND(B47=\"Piedmont\",I47>0.0001,I47<0.1),0.41, IF(AND(B47=\"Piedmont\",I47>10), 2.45, IF(B47=\"Piedmont\",I47^0.39, IF(AND(B47=\"Coastal Plain\",I47>0.0001,I47<0.1),0.42,IF(AND(B47=\"Coastal Plain\",I47>10),2.4, IF(B47=\"Coastal Plain\",I47^0.38, IF(AND(B47=\"Mountain\",I47>0.0001,I47<0.1),0.36,IF(AND(B47=\"Mountain\",I47>10),2.75,IF(B47=\"Mountain\",I47^0.44)))))))))","v":false},null,null,{"$f":"F49-F47","v":0},null,{"$f":"IF(AND(N47=\"No Existing Protection\",O47=\"Deed Restriction\"), 0.02, IF(AND(N47=\"No Existing Protection\",O47=\"Easement\"), 0.05, IF(AND(N47=\"No Existing Protection\", O47=\"Accredited Easement\"), 0.07, IF(AND(N47=\"No Existing Protection\", O47=\"Fee Simple to Conservation Holder\"), 0.09, IF(AND(N47=\"Agricultural Easement\",O47=\"Deed Restriction\"), 0.01, IF(AND(N47=\"Agricultural Easement\",O47=\"Easement\"), 0.04, IF(AND(N47=\"Agricultural Easement\", O47=\"Accredited Easement\"), 0.06, IF(AND(N47=\"Agricultural Easement\", O47=\"Fee Simple to Conservation Holder\"), 0.09, IF(AND(N47=\"Environmental Easement\",O47=\"Deed Restriction\"), 0, IF(AND(N47=\"Environmental Easement\", O47=\"Easement\"), 0.02, IF(AND(N47=\"Environmental Easement\", O47=\"Accredited Easement\"), 0.03, IF(AND(N47=\"Public Land\", O47=\"Public Land MOA\"), 0.02, 0))))))))))))","v":0}]
[null,{"$f":"B47","v":"Not Selected"},"Proposed","Select from Dropdown","Select",null,null,{"$f":"H47","v":"Select"},0,{"$f":"IF(H49=\"Second\",(F49*G49*H50*1), IF(H49=\"Third\",(F49*G49*H50*1), (F49*G49*H50*I50)))","v":0},null,0.5,{"$f":"IF(D49=\"Preservation\",((J49*0.1)*M47),(K47+L50)*M47)","v":0},{"$f":"IF(H47=\"Second\",(J49*N48),IF(H47=\"Third\",(J49*N48),(J49/I50*N48)))","v":{"$error":"#DIV/0!"}}]
[null,null,null,null,null,null,null,{"$f":"IF(H49=\"Primary\",1,IF(H49=\"Second\",0.2,IF(H49=\"Third\",0.1,IF(H49=\"Select\",0))))","v":0},{"$f":"IF(AND(B49=\"Piedmont\",I49>0.0001,I49<0.1),0.41, IF(AND(B49=\"Piedmont\",I49>10), 2.45, IF(B49=\"Piedmont\",I49^0.39, IF(AND(B49=\"Coastal Plain\",I49>0.0001,I49<0.1),0.42,IF(AND(B49=\"Coastal Plain\",I49>10),2.4, IF(B49=\"Coastal Plain\",I49^0.38, IF(AND(B49=\"Mountain\",I49>0.0001,I49<0.1),0.36,IF(AND(B49=\"Mountain\",I49>10),2.75,IF(B49=\"Mountain\",I49^0.44)))))))))","v":false},null,null,{"$f":"IF(AND(H47=\"Primary\",L47=\"Length Loss\"), L48*G47*I48*L49*-1,IF(AND(H47=\"Primary\", L47=\"Length Gain\"),L48*G49*I50*L49*-1,0))","v":0}]
[null,"Not Selected","Existing","Preliminary Resource Evaluation","Select",null,null,"Select",null,{"$f":"IF(H51=\"Second\",(F51*G51*H52*1), IF(H51=\"Third\",(F51*G51*H52*1), (F51*G51*H52*I52)))","v":0},{"$f":" J53-J51","v":0},{"$f":"IF(F51>F53, \"Length Loss\", IF(F51<F53, \"Length Gain\", IF(F51=F53, \"No Change\")))","v":"No Change"},0,"Existing: Select From Dropdown","Proposed: Select From Dropdown",{"$f":"IF(D53=\"Restoration/Enhancement\",SUM(K51,L54,M53,N53),IF(D53=\"Preservation\",((0.1*J53)+M53+N53),\"NA\"))","v":"NA"}]
[null,null,null,null,null,null,null,{"$f":"IF(H51=\"Primary\",1,IF(H51=\"Second\",0.2,IF(H51=\"Third\",0.1,IF(H51=\"Select\",0))))","v":0},{"$f":"IF(AND(B51=\"Piedmont\",I51>0.0001,I51<0.1),0.41, IF(AND(B51=\"Piedmont\",I51>10), 2.45, IF(B51=\"Piedmont\",I51^0.39, IF(AND(B51=\"Coastal Plain\",I51>0.0001,I51<0.1),0.42,IF(AND(B51=\"Coastal Plain\",I51>10),2.4, IF(B51=\"Coastal Plain\",I51^0.38, IF(AND(B51=\"Mountain\",I51>0.0001,I51<0.1),0.36,IF(AND(B51=\"Mountain\",I51>10),2.75,IF(B51=\"Mountain\",I51^0.44)))))))))","v":false},null,null,{"$f":"F53-F51","v":0},null,{"$f":"IF(AND(N51=\"No Existing Protection\",O51=\"Deed Restriction\"), 0.02, IF(AND(N51=\"No Existing Protection\",O51=\"Easement\"), 0.05, IF(AND(N51=\"No Existing Protection\", O51=\"Accredited Easement\"), 0.07, IF(AND(N51=\"No Existing Protection\", O51=\"Fee Simple to Conservation Holder\"), 0.09, IF(AND(N51=\"Agricultural Easement\",O51=\"Deed Restriction\"), 0.01, IF(AND(N51=\"Agricultural Easement\",O51=\"Easement\"), 0.04, IF(AND(N51=\"Agricultural Easement\", O51=\"Accredited Easement\"), 0.06, IF(AND(N51=\"Agricultural Easement\", O51=\"Fee Simple to Conservation Holder\"), 0.09, IF(AND(N51=\"Environmental Easement\",O51=\"Deed Restriction\"), 0, IF(AND(N51=\"Environmental Easement\", O51=\"Easement\"), 0.02, IF(AND(N51=\"Environmental Easement\", O51=\"Accredited Easement\"), 0.03, IF(AND(N51=\"Public Land\", O51=\"Public Land MOA\"), 0.02, 0))))))))))))","v":0}]
[null,{"$f":"B51","v":"Not Selected"},"Proposed","Select from Dropdown","Select",null,null,{"$f":"H51","v":"Select"},0,{"$f":"IF(H53=\"Second\",(F53*G53*H54*1), IF(H53=\"Third\",(F53*G53*H54*1), (F53*G53*H54*I54)))","v":0},null,0.5,{"$f":"IF(D53=\"Preservation\",((J53*0.1)*M51),(K51+L54)*M51)","v":0},{"$f":"IF(H51=\"Second\",(J53*N52),IF(H51=\"Third\",(J53*N52),(J53/I54*N52)))","v":{"$error":"#DIV/0!"}}]
[null,null,null,null,null,null,null,{"$f":"IF(H53=\"Primary\",1,IF(H53=\"Second\",0.2,IF(H53=\"Third\",0.1,IF(H53=\"Select\",0))))","v":0},{"$f":"IF(AND(B53=\"Piedmont\",I53>0.0001,I53<0.1),0.41, IF(AND(B53=\"Piedmont\",I53>10), 2.45, IF(B53=\"Piedmont\",I53^0.39, IF(AND(B53=\"Coastal Plain\",I53>0.0001,I53<0.1),0.42,IF(AND(B53=\"Coastal Plain\",I53>10),2.4, IF(B53=\"Coastal Plain\",I53^0.38, IF(AND(B53=\"Mountain\",I53>0.0001,I53<0.1),0.36,IF(AND(B53=\"Mountain\",I53>10),2.75,IF(B53=\"Mountain\",I53^0.44)))))))))","v":false},null,null,{"$f":"IF(AND(H51=\"Primary\",L51=\"Length Loss\"), L52*G51*I52*L53*-1,IF(AND(H51=\"Primary\", L51=\"Length Gain\"),L52*G53*I54*L53*-1,0))","v":0}]
[null,"Not Selected","Existing","Preliminary Resource Evaluation","Select",null,null,"Select",null,{"$f":"IF(H55=\"Second\",(F55*G55*H56*1), IF(H55=\"Third\",(F55*G55*H56*1), (F55*G55*H56*I56)))","v":0},{"$f":" J57-J55","v":0},{"$f":"IF(F55>F57, \"Length Loss\", IF(F55<F57, \"Length Gain\", IF(F55=F57, \"No Change\")))","v":"No Change"},0,"Existing: Select From Dropdown","Proposed: Select From Dropdown",{"$f":"IF(D57=\"Restoration/Enhancement\",SUM(K55,L58,M57,N57),IF(D57=\"Preservation\",((0.1*J57)+M57+N57),\"NA\"))","v":"NA"}]
[null,null,null,null,null,null,null,{"$f":"IF(H55=\"Primary\",1,IF(H55=\"Second\",0.2,IF(H55=\"Third\",0.1,IF(H55=\"Select\",0))))","v":0},{"$f":"IF(AND(B55=\"Piedmont\",I55>0.0001,I55<0.1),0.41, IF(AND(B55=\"Piedmont\",I55>10), 2.45, IF(B55=\"Piedmont\",I55^0.39, IF(AND(B55=\"Coastal Plain\",I55>0.0001,I55<0.1),0.42,IF(AND(B55=\"Coastal Plain\",I55>10),2.4, IF(B55=\"Coastal Plain\",I55^0.38, IF(AND(B55=\"Mountain\",I55>0.0001,I55<0.1),0.36,IF(AND(B55=\"Mountain\",I55>10),2.75,IF(B55=\"Mountain\",I55^0.44)))))))))","v":false},null,null,{"$f":"F57-F55","v":0},null,{"$f":"IF(AND(N55=\"No Existing Protection\",O55=\"Deed Restriction\"), 0.02, IF(AND(N55=\"No Existing Protection\",O55=\"Easement\"), 0.05, IF(AND(N55=\"No Existing Protection\", O55=\"Accredited Easement\"), 0.07, IF(AND(N55=\"No Existing Protection\", O55=\"Fee Simple to Conservation Holder\"), 0.09, IF(AND(N55=\"Agricultural Easement\",O55=\"Deed Restriction\"), 0.01, IF(AND(N55=\"Agricultural Easement\",O55=\"Easement\"), 0.04, IF(AND(N55=\"Agricultural Easement\", O55=\"Accredited Easement\"), 0.06, IF(AND(N55=\"Agricultural Easement\", O55=\"Fee Simple to Conservation Holder\"), 0.09, IF(AND(N55=\"Environmental Easement\",O55=\"Deed Restriction\"), 0, IF(AND(N55=\"Environmental Easement\", O55=\"Easement\"), 0.02, IF(AND(N55=\"Environmental Easement\", O55=\"Accredited Easement\"), 0.03, IF(AND(N55=\"Public Land\", O55=\"Public Land MOA\"), 0.02, 0))))))))))))","v":0}]
[null,{"$f":"B55","v":"Not Selected"},"Proposed","Select from Dropdown","Select",null,null,{"$f":"H55","v":"Select"},0,{"$f":"IF(H57=\"Second\",(F57*G57*H58*1), IF(H57=\"Third\",(F57*G57*H58*1), (F57*G57*H58*I58)))","v":0},null,0.5,{"$f":"IF(D57=\"Preservation\",((J57*0.1)*M55),(K55+L58)*M55)","v":0},{"$f":"IF(H55=\"Second\",(J57*N56),IF(H55=\"Third\",(J57*N56),(J57/I58*N56)))","v":{"$error":"#DIV/0!"}}]
[null,null,null,null,null,null,null,{"$f":"IF(H57=\"Primary\",1,IF(H57=\"Second\",0.2,IF(H57=\"Third\",0.1,IF(H57=\"Select\",0))))","v":0},{"$f":"IF(AND(B57=\"Piedmont\",I57>0.0001,I57<0.1),0.41, IF(AND(B57=\"Piedmont\",I57>10), 2.45, IF(B57=\"Piedmont\",I57^0.39, IF(AND(B57=\"Coastal Plain\",I57>0.0001,I57<0.1),0.42,IF(AND(B57=\"Coastal Plain\",I57>10),2.4, IF(B57=\"Coastal Plain\",I57^0.38, IF(AND(B57=\"Mountain\",I57>0.0001,I57<0.1),0.36,IF(AND(B57=\"Mountain\",I57>10),2.75,IF(B57=\"Mountain\",I57^0.44)))))))))","v":false},null,null,{"$f":"IF(AND(H55=\"Primary\",L55=\"Length Loss\"), L56*G55*I56*L57*-1,IF(AND(H55=\"Primary\", L55=\"Length Gain\"),L56*G57*I58*L57*-1,0))","v":0}]
[null,"Not Selected","Existing","Preliminary Resource Evaluation","Select",null,null,"Select",null,{"$f":"IF(H59=\"Second\",(F59*G59*H60*1), IF(H59=\"Third\",(F59*G59*H60*1), (F59*G59*H60*I60)))","v":0},{"$f":" J61-J59","v":0},{"$f":"IF(F59>F61, \"Length Loss\", IF(F59<F61, \"Length Gain\", IF(F59=F61, \"No Change\")))","v":"No Change"},0,"Existing: Select From Dropdown","Proposed: Select From Dropdown",{"$f":"IF(D61=\"Restoration/Enhancement\",SUM(K59,L62,M61,N61),IF(D61=\"Preservation\",((0.1*J61)+M61+N61),\"NA\"))","v":"NA"}]
[null,null,null,null,null,null,null,{"$f":"IF(H59=\"Primary\",1,IF(H59=\"Second\",0.2,IF(H59=\"Third\",0.1,IF(H59=\"Select\",0))))","v":0},{"$f":"IF(AND(B59=\"Piedmont\",I59>0.0001,I59<0.1),0.41, IF(AND(B59=\"Piedmont\",I59>10), 2.45, IF(B59=\"Piedmont\",I59^0.39, IF(AND(B59=\"Coastal Plain\",I59>0.0001,I59<0.1),0.42,IF(AND(B59=\"Coastal Plain\",I59>10),2.4, IF(B59=\"Coastal Plain\",I59^0.38, IF(AND(B59=\"Mountain\",I59>0.0001,I59<0.1),0.36,IF(AND(B59=\"Mountain\",I59>10),2.75,IF(B59=\"Mountain\",I59^0.44)))))))))","v":false},null,null,{"$f":"F61-F59","v":0},null,{"$f":"IF(AND(N59=\"No Existing Protection\",O59=\"Deed Restriction\"), 0.02, IF(AND(N59=\"No Existing Protection\",O59=\"Easement\"), 0.05, IF(AND(N59=\"No Existing Protection\", O59=\"Accredited Easement\"), 0.07, IF(AND(N59=\"No Existing Protection\", O59=\"Fee Simple to Conservation Holder\"), 0.09, IF(AND(N59=\"Agricultural Easement\",O59=\"Deed Restriction\"), 0.01, IF(AND(N59=\"Agricultural Easement\",O59=\"Easement\"), 0.04, IF(AND(N59=\"Agricultural Easement\", O59=\"Accredited Easement\"), 0.06, IF(AND(N59=\"Agricultural Easement\", O59=\"Fee Simple to Conservation Holder\"), 0.09, IF(AND(N59=\"Environmental Easement\",O59=\"Deed Restriction\"), 0, IF(AND(N59=\"Environmental Easement\", O59=\"Easement\"), 0.02, IF(AND(N59=\"Environmental Easement\", O59=\"Accredited Easement\"), 0.03, IF(AND(N59=\"Public Land\", O59=\"Public Land MOA\"), 0.02, 0))))))))))))","v":0}]
[null,{"$f":"B59","v":"Not Selected"},"Proposed","Select from Dropdown","Select",null,null,{"$f":"H59","v":"Select"},0,{"$f":"IF(H61=\"Second\",(F61*G61*H62*1), IF(H61=\"Third\",(F61*G61*H62*1), (F61*G61*H62*I62)))","v":0},null,0.5,{"$f":"IF(D61=\"Preservation\",((J61*0.1)*M59),(K59+L62)*M59)","v":0},{"$f":"IF(H59=\"Second\",(J61*N60),IF(H59=\"Third\",(J61*N60),(J61/I62*N60)))","v":{"$error":"#DIV/0!"}}]
[null,null,null,null,null,null,null,{"$f":"IF(H61=\"Primary\",1,IF(H61=\"Second\",0.2,IF(H61=\"Third\",0.1,IF(H61=\"Select\",0))))","v":0},{"$f":"IF(AND(B61=\"Piedmont\",I61>0.0001,I61<0.1),0.41, IF(AND(B61=\"Piedmont\",I61>10), 2.45, IF(B61=\"Piedmont\",I61^0.39, IF(AND(B61=\"Coastal Plain\",I61>0.0001,I61<0.1),0.42,IF(AND(B61=\"Coastal Plain\",I61>10),2.4, IF(B61=\"Coastal Plain\",I61^0.38, IF(AND(B61=\"Mountain\",I61>0.0001,I61<0.1),0.36,IF(AND(B61=\"Mountain\",I61>10),2.75,IF(B61=\"Mountain\",I61^0.44)))))))))","v":false},null,null,{"$f":"IF(AND(H59=\"Primary\",L59=\"Length Loss\"), L60*G59*I60*L61*-1,IF(AND(H59=\"Primary\", L59=\"Length Gain\"),L60*G61*I62*L61*-1,0))","v":0}]
[null,"Not Selected","Existing","Preliminary Resource Evaluation","Select",null,null,"Select",null,{"$f":"IF(H63=\"Second\",(F63*G63*H64*1), IF(H63=\"Third\",(F63*G63*H64*1), (F63*G63*H64*I64)))","v":0},{"$f":" J65-J63","v":0},{"$f":"IF(F63>F65, \"Length Loss\", IF(F63<F65, \"Length Gain\", IF(F63=F65, \"No Change\")))","v":"No Change"},0,"Existing: Select From Dropdown","Proposed: Select From Dropdown",{"$f":"IF(D65=\"Restoration/Enhancement\",SUM(K63,L66,M65,N65),IF(D65=\"Preservation\",((0.1*J65)+M65+N65),\"NA\"))","v":"NA"}]
[null,null,null,null,null,null,null,{"$f":"IF(H63=\"Primary\",1,IF(H63=\"Second\",0.2,IF(H63=\"Third\",0.1,IF(H63=\"Select\",0))))","v":0},{"$f":"IF(AND(B63=\"Piedmont\",I63>0.0001,I63<0.1),0.41, IF(AND(B63=\"Piedmont\",I63>10), 2.45, IF(B63=\"Piedmont\",I63^0.39, IF(AND(B63=\"Coastal Plain\",I63>0.0001,I63<0.1),0.42,IF(AND(B63=\"Coastal Plain\",I63>10),2.4, IF(B63=\"Coastal Plain\",I63^0.38, IF(AND(B63=\"Mountain\",I63>0.0001,I63<0.1),0.36,IF(AND(B63=\"Mountain\",I63>10),2.75,IF(B63=\"Mountain\",I63^0.44)))))))))","v":false},null,null,{"$f":"F65-F63","v":0},null,{"$f":"IF(AND(N63=\"No Existing Protection\",O63=\"Deed Restriction\"), 0.02, IF(AND(N63=\"No Existing Protection\",O63=\"Easement\"), 0.05, IF(AND(N63=\"No Existing Protection\", O63=\"Accredited Easement\"), 0.07, IF(AND(N63=\"No Existing Protection\", O63=\"Fee Simple to Conservation Holder\"), 0.09, IF(AND(N63=\"Agricultural Easement\",O63=\"Deed Restriction\"), 0.01, IF(AND(N63=\"Agricultural Easement\",O63=\"Easement\"), 0.04, IF(AND(N63=\"Agricultural Easement\", O63=\"Accredited Easement\"), 0.06, IF(AND(N63=\"Agricultural Easement\", O63=\"Fee Simple to Conservation Holder\"), 0.09, IF(AND(N63=\"Environmental Easement\",O63=\"Deed Restriction\"), 0, IF(AND(N63=\"Environmental Easement\", O63=\"Easement\"), 0.02, IF(AND(N63=\"Environmental Easement\", O63=\"Accredited Easement\"), 0.03, IF(AND(N63=\"Public Land\", O63=\"Public Land MOA\"), 0.02, 0))))))))))))","v":0}]
[null,{"$f":"B63","v":"Not Selected"},"Proposed","Select from Dropdown","Select",null,null,{"$f":"H63","v":"Select"},0,{"$f":"IF(H65=\"Second\",(F65*G65*H66*1), IF(H65=\"Third\",(F65*G65*H66*1), (F65*G65*H66*I66)))","v":0},null,0.5,{"$f":"IF(D65=\"Preservation\",((J65*0.1)*M63),(K63+L66)*M63)","v":0},{"$f":"IF(H63=\"Second\",(J65*N64),IF(H63=\"Third\",(J65*N64),(J65/I66*N64)))","v":{"$error":"#DIV/0!"}}]
[null,null,null,null,null,null,null,{"$f":"IF(H65=\"Primary\",1,IF(H65=\"Second\",0.2,IF(H65=\"Third\",0.1,IF(H65=\"Select\",0))))","v":0},{"$f":"IF(AND(B65=\"Piedmont\",I65>0.0001,I65<0.1),0.41, IF(AND(B65=\"Piedmont\",I65>10), 2.45, IF(B65=\"Piedmont\",I65^0.39, IF(AND(B65=\"Coastal Plain\",I65>0.0001,I65<0.1),0.42,IF(AND(B65=\"Coastal Plain\",I65>10),2.4, IF(B65=\"Coastal Plain\",I65^0.38, IF(AND(B65=\"Mountain\",I65>0.0001,I65<0.1),0.36,IF(AND(B65=\"Mountain\",I65>10),2.75,IF(B65=\"Mountain\",I65^0.44)))))))))","v":false},null,null,{"$f":"IF(AND(H63=\"Primary\",L63=\"Length Loss\"), L64*G63*I64*L65*-1,IF(AND(H63=\"Primary\", L63=\"Length Gain\"),L64*G65*I66*L65*-1,0))","v":0}]
[null,"Not Selected","Existing","Preliminary Resource Evaluation","Select",null,null,"Select",null,{"$f":"IF(H67=\"Second\",(F67*G67*H68*1), IF(H67=\"Third\",(F67*G67*H68*1), (F67*G67*H68*I68)))","v":0},{"$f":" J69-J67","v":0},{"$f":"IF(F67>F69, \"Length Loss\", IF(F67<F69, \"Length Gain\", IF(F67=F69, \"No Change\")))","v":"No Change"},0,"Existing: Select From Dropdown","Proposed: Select From Dropdown",{"$f":"IF(D69=\"Restoration/Enhancement\",SUM(K67,L70,M69,N69),IF(D69=\"Preservation\",((0.1*J69)+M69+N69),\"NA\"))","v":"NA"}]
[null,null,null,null,null,null,null,{"$f":"IF(H67=\"Primary\",1,IF(H67=\"Second\",0.2,IF(H67=\"Third\",0.1,IF(H67=\"Select\",0))))","v":0},{"$f":"IF(AND(B67=\"Piedmont\",I67>0.0001,I67<0.1),0.41, IF(AND(B67=\"Piedmont\",I67>10), 2.45, IF(B67=\"Piedmont\",I67^0.39, IF(AND(B67=\"Coastal Plain\",I67>0.0001,I67<0.1),0.42,IF(AND(B67=\"Coastal Plain\",I67>10),2.4, IF(B67=\"Coastal Plain\",I67^0.38, IF(AND(B67=\"Mountain\",I67>0.0001,I67<0.1),0.36,IF(AND(B67=\"Mountain\",I67>10),2.75,IF(B67=\"Mountain\",I67^0.44)))))))))","v":false},null,null,{"$f":"F69-F67","v":0},null,{"$f":"IF(AND(N67=\"No Existing Protection\",O67=\"Deed Restriction\"), 0.02, IF(AND(N67=\"No Existing Protection\",O67=\"Easement\"), 0.05, IF(AND(N67=\"No Existing Protection\", O67=\"Accredited Easement\"), 0.07, IF(AND(N67=\"No Existing Protection\", O67=\"Fee Simple to Conservation Holder\"), 0.09, IF(AND(N67=\"Agricultural Easement\",O67=\"Deed Restriction\"), 0.01, IF(AND(N67=\"Agricultural Easement\",O67=\"Easement\"), 0.04, IF(AND(N67=\"Agricultural Easement\", O67=\"Accredited Easement\"), 0.06, IF(AND(N67=\"Agricultural Easement\", O67=\"Fee Simple to Conservation Holder\"), 0.09, IF(AND(N67=\"Environmental Easement\",O67=\"Deed Restriction\"), 0, IF(AND(N67=\"Environmental Easement\", O67=\"Easement\"), 0.02, IF(AND(N67=\"Environmental Easement\", O67=\"Accredited Easement\"), 0.03, IF(AND(N67=\"Public Land\", O67=\"Public Land MOA\"), 0.02, 0))))))))))))","v":0}]
[null,{"$f":"B67","v":"Not Selected"},"Proposed","Select from Dropdown","Select",null,null,{"$f":"H67","v":"Select"},0,{"$f":"IF(H69=\"Second\",(F69*G69*H70*1), IF(H69=\"Third\",(F69*G69*H70*1), (F69*G69*H70*I70)))","v":0},null,0.5,{"$f":"IF(D69=\"Preservation\",((J69*0.1)*M67),(K67+L70)*M67)","v":0},{"$f":"IF(H67=\"Second\",(J69*N68),IF(H67=\"Third\",(J69*N68),(J69/I70*N68)))","v":{"$error":"#DIV/0!"}}]
[null,null,null,null,null,null,null,{"$f":"IF(H69=\"Primary\",1,IF(H69=\"Second\",0.2,IF(H69=\"Third\",0.1,IF(H69=\"Select\",0))))","v":0},{"$f":"IF(AND(B69=\"Piedmont\",I69>0.0001,I69<0.1),0.41, IF(AND(B69=\"Piedmont\",I69>10), 2.45, IF(B69=\"Piedmont\",I69^0.39, IF(AND(B69=\"Coastal Plain\",I69>0.0001,I69<0.1),0.42,IF(AND(B69=\"Coastal Plain\",I69>10),2.4, IF(B69=\"Coastal Plain\",I69^0.38, IF(AND(B69=\"Mountain\",I69>0.0001,I69<0.1),0.36,IF(AND(B69=\"Mountain\",I69>10),2.75,IF(B69=\"Mountain\",I69^0.44)))))))))","v":false},null,null,{"$f":"IF(AND(H67=\"Primary\",L67=\"Length Loss\"), L68*G67*I68*L69*-1,IF(AND(H67=\"Primary\", L67=\"Length Gain\"),L68*G69*I70*L69*-1,0))","v":0}]
[null,"Not Selected","Existing","Preliminary Resource Evaluation","Select",null,null,"Select",null,{"$f":"IF(H71=\"Second\",(F71*G71*H72*1), IF(H71=\"Third\",(F71*G71*H72*1), (F71*G71*H72*I72)))","v":0},{"$f":" J73-J71","v":0},{"$f":"IF(F71>F73, \"Length Loss\", IF(F71<F73, \"Length Gain\", IF(F71=F73, \"No Change\")))","v":"No Change"},0,"Existing: Select From Dropdown","Proposed: Select From Dropdown",{"$f":"IF(D73=\"Restoration/Enhancement\",SUM(K71,L74,M73,N73),IF(D73=\"Preservation\",((0.1*J73)+M73+N73),\"NA\"))","v":"NA"}]
[null,null,null,null,null,null,null,{"$f":"IF(H71=\"Primary\",1,IF(H71=\"Second\",0.2,IF(H71=\"Third\",0.1,IF(H71=\"Select\",0))))","v":0},{"$f":"IF(AND(B71=\"Piedmont\",I71>0.0001,I71<0.1),0.41, IF(AND(B71=\"Piedmont\",I71>10), 2.45, IF(B71=\"Piedmont\",I71^0.39, IF(AND(B71=\"Coastal Plain\",I71>0.0001,I71<0.1),0.42,IF(AND(B71=\"Coastal Plain\",I71>10),2.4, IF(B71=\"Coastal Plain\",I71^0.38, IF(AND(B71=\"Mountain\",I71>0.0001,I71<0.1),0.36,IF(AND(B71=\"Mountain\",I71>10),2.75,IF(B71=\"Mountain\",I71^0.44)))))))))","v":false},null,null,{"$f":"F73-F71","v":0},null,{"$f":"IF(AND(N71=\"No Existing Protection\",O71=\"Deed Restriction\"), 0.02, IF(AND(N71=\"No Existing Protection\",O71=\"Easement\"), 0.05, IF(AND(N71=\"No Existing Protection\", O71=\"Accredited Easement\"), 0.07, IF(AND(N71=\"No Existing Protection\", O71=\"Fee Simple to Conservation Holder\"), 0.09, IF(AND(N71=\"Agricultural Easement\",O71=\"Deed Restriction\"), 0.01, IF(AND(N71=\"Agricultural Easement\",O71=\"Easement\"), 0.04, IF(AND(N71=\"Agricultural Easement\", O71=\"Accredited Easement\"), 0.06, IF(AND(N71=\"Agricultural Easement\", O71=\"Fee Simple to Conservation Holder\"), 0.09, IF(AND(N71=\"Environmental Easement\",O71=\"Deed Restriction\"), 0, IF(AND(N71=\"Environmental Easement\", O71=\"Easement\"), 0.02, IF(AND(N71=\"Environmental Easement\", O71=\"Accredited Easement\"), 0.03, IF(AND(N71=\"Public Land\", O71=\"Public Land MOA\"), 0.02, 0))))))))))))","v":0}]
[null,{"$f":"B71","v":"Not Selected"},"Proposed","Select from Dropdown","Select",null,null,{"$f":"H71","v":"Select"},0,{"$f":"IF(H73=\"Second\",(F73*G73*H74*1), IF(H73=\"Third\",(F73*G73*H74*1), (F73*G73*H74*I74)))","v":0},null,0.5,{"$f":"IF(D73=\"Preservation\",((J73*0.1)*M71),(K71+L74)*M71)","v":0},{"$f":"IF(H71=\"Second\",(J73*N72),IF(H71=\"Third\",(J73*N72),(J73/I74*N72)))","v":{"$error":"#DIV/0!"}}]
[null,null,null,null,null,null,null,{"$f":"IF(H73=\"Primary\",1,IF(H73=\"Second\",0.2,IF(H73=\"Third\",0.1,IF(H73=\"Select\",0))))","v":0},{"$f":"IF(AND(B73=\"Piedmont\",I73>0.0001,I73<0.1),0.41, IF(AND(B73=\"Piedmont\",I73>10), 2.45, IF(B73=\"Piedmont\",I73^0.39, IF(AND(B73=\"Coastal Plain\",I73>0.0001,I73<0.1),0.42,IF(AND(B73=\"Coastal Plain\",I73>10),2.4, IF(B73=\"Coastal Plain\",I73^0.38, IF(AND(B73=\"Mountain\",I73>0.0001,I73<0.1),0.36,IF(AND(B73=\"Mountain\",I73>10),2.75,IF(B73=\"Mountain\",I73^0.44)))))))))","v":false},null,null,{"$f":"IF(AND(H71=\"Primary\",L71=\"Length Loss\"), L72*G71*I72*L73*-1,IF(AND(H71=\"Primary\", L71=\"Length Gain\"),L72*G73*I74*L73*-1,0))","v":0}]
[null,"Not Selected","Existing","Preliminary Resource Evaluation","Select",null,null,"Select",null,{"$f":"IF(H75=\"Second\",(F75*G75*H76*1), IF(H75=\"Third\",(F75*G75*H76*1), (F75*G75*H76*I76)))","v":0},{"$f":" J77-J75","v":0},{"$f":"IF(F75>F77, \"Length Loss\", IF(F75<F77, \"Length Gain\", IF(F75=F77, \"No Change\")))","v":"No Change"},0,"Existing: Select From Dropdown","Proposed: Select From Dropdown",{"$f":"IF(D77=\"Restoration/Enhancement\",SUM(K75,L78,M77,N77),IF(D77=\"Preservation\",((0.1*J77)+M77+N77),\"NA\"))","v":"NA"}]
[null,null,null,null,null,null,null,{"$f":"IF(H75=\"Primary\",1,IF(H75=\"Second\",0.2,IF(H75=\"Third\",0.1,IF(H75=\"Select\",0))))","v":0},{"$f":"IF(AND(B75=\"Piedmont\",I75>0.0001,I75<0.1),0.41, IF(AND(B75=\"Piedmont\",I75>10), 2.45, IF(B75=\"Piedmont\",I75^0.39, IF(AND(B75=\"Coastal Plain\",I75>0.0001,I75<0.1),0.42,IF(AND(B75=\"Coastal Plain\",I75>10),2.4, IF(B75=\"Coastal Plain\",I75^0.38, IF(AND(B75=\"Mountain\",I75>0.0001,I75<0.1),0.36,IF(AND(B75=\"Mountain\",I75>10),2.75,IF(B75=\"Mountain\",I75^0.44)))))))))","v":false},null,null,{"$f":"F77-F75","v":0},null,{"$f":"IF(AND(N75=\"No Existing Protection\",O75=\"Deed Restriction\"), 0.02, IF(AND(N75=\"No Existing Protection\",O75=\"Easement\"), 0.05, IF(AND(N75=\"No Existing Protection\", O75=\"Accredited Easement\"), 0.07, IF(AND(N75=\"No Existing Protection\", O75=\"Fee Simple to Conservation Holder\"), 0.09, IF(AND(N75=\"Agricultural Easement\",O75=\"Deed Restriction\"), 0.01, IF(AND(N75=\"Agricultural Easement\",O75=\"Easement\"), 0.04, IF(AND(N75=\"Agricultural Easement\", O75=\"Accredited Easement\"), 0.06, IF(AND(N75=\"Agricultural Easement\", O75=\"Fee Simple to Conservation Holder\"), 0.09, IF(AND(N75=\"Environmental Easement\",O75=\"Deed Restriction\"), 0, IF(AND(N75=\"Environmental Easement\", O75=\"Easement\"), 0.02, IF(AND(N75=\"Environmental Easement\", O75=\"Accredited Easement\"), 0.03, IF(AND(N75=\"Public Land\", O75=\"Public Land MOA\"), 0.02, 0))))))))))))","v":0}]
[null,{"$f":"B75","v":"Not Selected"},"Proposed","Select from Dropdown","Select",null,null,{"$f":"H75","v":"Select"},0,{"$f":"IF(H77=\"Second\",(F77*G77*H78*1), IF(H77=\"Third\",(F77*G77*H78*1), (F77*G77*H78*I78)))","v":0},null,0.5,{"$f":"IF(D77=\"Preservation\",((J77*0.1)*M75),(K75+L78)*M75)","v":0},{"$f":"IF(H75=\"Second\",(J77*N76),IF(H75=\"Third\",(J77*N76),(J77/I78*N76)))","v":{"$error":"#DIV/0!"}}]
[null,null,null,null,null,null,null,{"$f":"IF(H77=\"Primary\",1,IF(H77=\"Second\",0.2,IF(H77=\"Third\",0.1,IF(H77=\"Select\",0))))","v":0},{"$f":"IF(AND(B77=\"Piedmont\",I77>0.0001,I77<0.1),0.41, IF(AND(B77=\"Piedmont\",I77>10), 2.45, IF(B77=\"Piedmont\",I77^0.39, IF(AND(B77=\"Coastal Plain\",I77>0.0001,I77<0.1),0.42,IF(AND(B77=\"Coastal Plain\",I77>10),2.4, IF(B77=\"Coastal Plain\",I77^0.38, IF(AND(B77=\"Mountain\",I77>0.0001,I77<0.1),0.36,IF(AND(B77=\"Mountain\",I77>10),2.75,IF(B77=\"Mountain\",I77^0.44)))))))))","v":false},null,null,{"$f":"IF(AND(H75=\"Primary\",L75=\"Length Loss\"), L76*G75*I76*L77*-1,IF(AND(H75=\"Primary\", L75=\"Length Gain\"),L76*G77*I78*L77*-1,0))","v":0}]
[null,"Not Selected","Existing","Preliminary Resource Evaluation","Select",null,null,"Select",null,{"$f":"IF(H79=\"Second\",(F79*G79*H80*1), IF(H79=\"Third\",(F79*G79*H80*1), (F79*G79*H80*I80)))","v":0},{"$f":" J81-J79","v":0},{"$f":"IF(F79>F81, \"Length Loss\", IF(F79<F81, \"Length Gain\", IF(F79=F81, \"No Change\")))","v":"No Change"},0,"Existing: Select From Dropdown","Proposed: Select From Dropdown",{"$f":"IF(D81=\"Restoration/Enhancement\",SUM(K79,L82,M81,N81),IF(D81=\"Preservation\",((0.1*J81)+M81+N81),\"NA\"))","v":"NA"}]
[null,null,null,null,null,null,null,{"$f":"IF(H79=\"Primary\",1,IF(H79=\"Second\",0.2,IF(H79=\"Third\",0.1,IF(H79=\"Select\",0))))","v":0},{"$f":"IF(AND(B79=\"Piedmont\",I79>0.0001,I79<0.1),0.41, IF(AND(B79=\"Piedmont\",I79>10), 2.45, IF(B79=\"Piedmont\",I79^0.39, IF(AND(B79=\"Coastal Plain\",I79>0.0001,I79<0.1),0.42,IF(AND(B79=\"Coastal Plain\",I79>10),2.4, IF(B79=\"Coastal Plain\",I79^0.38, IF(AND(B79=\"Mountain\",I79>0.0001,I79<0.1),0.36,IF(AND(B79=\"Mountain\",I79>10),2.75,IF(B79=\"Mountain\",I79^0.44)))))))))","v":false},null,null,{"$f":"F81-F79","v":0},null,{"$f":"IF(AND(N79=\"No Existing Protection\",O79=\"Deed Restriction\"), 0.02, IF(AND(N79=\"No Existing Protection\",O79=\"Easement\"), 0.05, IF(AND(N79=\"No Existing Protection\", O79=\"Accredited Easement\"), 0.07, IF(AND(N79=\"No Existing Protection\", O79=\"Fee Simple to Conservation Holder\"), 0.09, IF(AND(N79=\"Agricultural Easement\",O79=\"Deed Restriction\"), 0.01, IF(AND(N79=\"Agricultural Easement\",O79=\"Easement\"), 0.04, IF(AND(N79=\"Agricultural Easement\", O79=\"Accredited Easement\"), 0.06, IF(AND(N79=\"Agricultural Easement\", O79=\"Fee Simple to Conservation Holder\"), 0.09, IF(AND(N79=\"Environmental Easement\",O79=\"Deed Restriction\"), 0, IF(AND(N79=\"Environmental Easement\", O79=\"Easement\"), 0.02, IF(AND(N79=\"Environmental Easement\", O79=\"Accredited Easement\"), 0.03, IF(AND(N79=\"Public Land\", O79=\"Public Land MOA\"), 0.02, 0))))))))))))","v":0}]
[null,{"$f":"B79","v":"Not Selected"},"Proposed","Select from Dropdown","Select",null,null,{"$f":"H79","v":"Select"},0,{"$f":"IF(H81=\"Second\",(F81*G81*H82*1), IF(H81=\"Third\",(F81*G81*H82*1), (F81*G81*H82*I82)))","v":0},null,0.5,{"$f":"IF(D81=\"Preservation\",((J81*0.1)*M79),(K79+L82)*M79)","v":0},{"$f":"IF(H79=\"Second\",(J81*N80),IF(H79=\"Third\",(J81*N80),(J81/I82*N80)))","v":{"$error":"#DIV/0!"}}]
[null,null,null,null,null,null,null,{"$f":"IF(H81=\"Primary\",1,IF(H81=\"Second\",0.2,IF(H81=\"Third\",0.1,IF(H81=\"Select\",0))))","v":0},{"$f":"IF(AND(B81=\"Piedmont\",I81>0.0001,I81<0.1),0.41, IF(AND(B81=\"Piedmont\",I81>10), 2.45, IF(B81=\"Piedmont\",I81^0.39, IF(AND(B81=\"Coastal Plain\",I81>0.0001,I81<0.1),0.42,IF(AND(B81=\"Coastal Plain\",I81>10),2.4, IF(B81=\"Coastal Plain\",I81^0.38, IF(AND(B81=\"Mountain\",I81>0.0001,I81<0.1),0.36,IF(AND(B81=\"Mountain\",I81>10),2.75,IF(B81=\"Mountain\",I81^0.44)))))))))","v":false},null,null,{"$f":"IF(AND(H79=\"Primary\",L79=\"Length Loss\"), L80*G79*I80*L81*-1,IF(AND(H79=\"Primary\", L79=\"Length Gain\"),L80*G81*I82*L81*-1,0))","v":0}]
[null,"Not Selected","Existing","Preliminary Resource Evaluation","Select",null,null,"Select",null,{"$f":"IF(H83=\"Second\",(F83*G83*H84*1), IF(H83=\"Third\",(F83*G83*H84*1), (F83*G83*H84*I84)))","v":0},{"$f":" J85-J83","v":0},{"$f":"IF(F83>F85, \"Length Loss\", IF(F83<F85, \"Length Gain\", IF(F83=F85, \"No Change\")))","v":"No Change"},0,"Existing: Select From Dropdown","Proposed: Select From Dropdown",{"$f":"IF(D85=\"Restoration/Enhancement\",SUM(K83,L86,M85,N85),IF(D85=\"Preservation\",((0.1*J85)+M85+N85),\"NA\"))","v":"NA"}]
[null,null,null,null,null,null,null,{"$f":"IF(H83=\"Primary\",1,IF(H83=\"Second\",0.2,IF(H83=\"Third\",0.1,IF(H83=\"Select\",0))))","v":0},{"$f":"IF(AND(B83=\"Piedmont\",I83>0.0001,I83<0.1),0.41, IF(AND(B83=\"Piedmont\",I83>10), 2.45, IF(B83=\"Piedmont\",I83^0.39, IF(AND(B83=\"Coastal Plain\",I83>0.0001,I83<0.1),0.42,IF(AND(B83=\"Coastal Plain\",I83>10),2.4, IF(B83=\"Coastal Plain\",I83^0.38, IF(AND(B83=\"Mountain\",I83>0.0001,I83<0.1),0.36,IF(AND(B83=\"Mountain\",I83>10),2.75,IF(B83=\"Mountain\",I83^0.44)))))))))","v":false},null,null,{"$f":"F85-F83","v":0},null,{"$f":"IF(AND(N83=\"No Existing Protection\",O83=\"Deed Restriction\"), 0.02, IF(AND(N83=\"No Existing Protection\",O83=\"Easement\"), 0.05, IF(AND(N83=\"No Existing Protection\", O83=\"Accredited Easement\"), 0.07, IF(AND(N83=\"No Existing Protection\", O83=\"Fee Simple to Conservation Holder\"), 0.09, IF(AND(N83=\"Agricultural Easement\",O83=\"Deed Restriction\"), 0.01, IF(AND(N83=\"Agricultural Easement\",O83=\"Easement\"), 0.04, IF(AND(N83=\"Agricultural Easement\", O83=\"Accredited Easement\"), 0.06, IF(AND(N83=\"Agricultural Easement\", O83=\"Fee Simple to Conservation Holder\"), 0.09, IF(AND(N83=\"Environmental Easement\",O83=\"Deed Restriction\"), 0, IF(AND(N83=\"Environmental Easement\", O83=\"Easement\"), 0.02, IF(AND(N83=\"Environmental Easement\", O83=\"Accredited Easement\"), 0.03, IF(AND(N83=\"Public Land\", O83=\"Public Land MOA\"), 0.02, 0))))))))))))","v":0}]
[null,{"$f":"B83","v":"Not Selected"},"Proposed","Select from Dropdown","Select",null,null,{"$f":"H83","v":"Select"},0,{"$f":"IF(H85=\"Second\",(F85*G85*H86*1), IF(H85=\"Third\",(F85*G85*H86*1), (F85*G85*H86*I86)))","v":0},null,0.5,{"$f":"IF(D85=\"Preservation\",((J85*0.1)*M83),(K83+L86)*M83)","v":0},{"$f":"IF(H83=\"Second\",(J85*N84),IF(H83=\"Third\",(J85*N84),(J85/I86*N84)))","v":{"$error":"#DIV/0!"}}]
[null,null,null,null,null,null,null,{"$f":"IF(H85=\"Primary\",1,IF(H85=\"Second\",0.2,IF(H85=\"Third\",0.1,IF(H85=\"Select\",0))))","v":0},{"$f":"IF(AND(B85=\"Piedmont\",I85>0.0001,I85<0.1),0.41, IF(AND(B85=\"Piedmont\",I85>10), 2.45, IF(B85=\"Piedmont\",I85^0.39, IF(AND(B85=\"Coastal Plain\",I85>0.0001,I85<0.1),0.42,IF(AND(B85=\"Coastal Plain\",I85>10),2.4, IF(B85=\"Coastal Plain\",I85^0.38, IF(AND(B85=\"Mountain\",I85>0.0001,I85<0.1),0.36,IF(AND(B85=\"Mountain\",I85>10),2.75,IF(B85=\"Mountain\",I85^0.44)))))))))","v":false},null,null,{"$f":"IF(AND(H83=\"Primary\",L83=\"Length Loss\"), L84*G83*I84*L85*-1,IF(AND(H83=\"Primary\", L83=\"Length Gain\"),L84*G85*I86*L85*-1,0))","v":0}]

{"sheet":"6_Bundled Stream Mit-Buffers ","index":5,"n_rows":64,"n_cols":14,"rows_kept":64,"cut":false,"hidden":false,"merged":[[61,0,62,1],[61,8,62,8],[61,9,62,9],[61,12,63,12],[61,13,63,17],[62,10,62,11],[63,0,63,8],[63,10,63,11],[58,0,59,1],[58,8,59,8],[58,9,59,9],[58,12,60,12],[58,13,60,17],[59,10,59,11],[60,0,60,8],[60,10,60,11],[55,0,56,1],[55,8,56,8],[55,9,56,9],[55,12,57,12],[55,13,57,17],[56,10,56,11],[57,0,57,8],[57,10,57,11],[52,0,53,1],[52,8,53,8],[52,9,53,9],[52,12,54,12],[52,13,54,17],[53,10,53,11],[54,0,54,8],[54,10,54,11],[49,0,50,1],[49,8,50,8],[49,9,50,9],[49,12,51,12],[49,13,51,17],[50,10,50,11],[51,0,51,8],[51,10,51,11],[46,0,47,1],[46,8,47,8],[46,9,47,9],[46,12,48,12],[46,13,48,17],[47,10,47,11],[48,0,48,8],[48,10,48,11],[43,0,44,1],[43,8,44,8],[43,9,44,9],[43,12,45,12],[43,13,45,17],[44,10,44,11],[45,0,45,8],[45,10,45,11],[40,0,41,1],[40,8,41,8],[40,9,41,9],[40,12,42,12],[40,13,42,17],[41,10,41,11],[42,0,42,8],[42,10,42,11],[37,0,38,1],[37,8,38,8],[37,9,38,9],[37,12,39,12],[37,13,39,17],[38,10,38,11],[39,0,39,8],[39,10,39,11],[34,0,35,1],[34,8,35,8],[34,9,35,9],[34,12,36,12],[34,13,36,17],[35,10,35,11],[36,0,36,8],[36,10,36,11],[31,0,32,1],[31,8,32,8],[31,9,32,9],[31,12,33,12],[31,13,33,17],[32,10,32,11],[33,0,33,8],[33,10,33,11],[28,0,29,1],[28,8,29,8],[28,9,29,9],[28,12,30,12],[28,13,30,17],[29,10,29,11],[30,0,30,8],[30,10,30,11],[25,0,26,1],[25,8,26,8],[25,9,26,9],[25,12,27,12],[25,13,27,17],[26,10,26,11],[27,0,27,8],[27,10,27,11],[22,0,23,1],[22,8,23,8],[22,9,23,9],[22,12,24,12],[22,13,24,17],[23,10,23,11],[24,0,24,8],[24,10,24,11],[19,0,20,1],[19,8,20,8],[19,9,20,9],[19,12,21,12],[19,13,21,17],[20,10,20,11],[21,0,21,8],[21,10,21,11],[16,0,17,1],[16,8,17,8],[16,9,17,9],[16,12,18,12],[16,13,18,17],[17,10,17,11],[18,0,18,8],[18,10,18,11],[13,0,14,1],[13,8,14,8],[13,9,14,9],[13,12,15,12],[13,13,15,17],[14,10,14,11],[15,0,15,8],[15,10,15,11],[10,0,11,1],[10,8,11,8],[10,9,11,9],[10,12,12,12],[10,13,12,17],[11,10,11,11],[12,0,12,8],[12,10,12,11],[7,0,7,8],[7,9,7,11],[7,12,9,12],[8,10,9,11],[4,0,4,2],[4,3,4,5],[4,6,4,7],[4,8,4,12],[7,13,9,17],[8,0,9,1],[8,2,9,2],[8,3,9,3],[8,4,9,4],[8,5,9,5],[8,6,9,6],[8,7,9,7],[8,8,9,8],[8,9,9,9],[4,13,6,17],[5,0,5,2],[5,3,5,5],[5,6,5,7],[5,8,5,12],[6,0,6,2],[0,0,1,17],[2,0,2,12],[2,13,3,17],[3,0,3,2],[3,3,3,5],[3,6,3,7],[3,8,3,12],[6,3,6,5],[6,6,6,7],[6,8,6,12]]}
["STREAM MITIGATION CALCULATOR for Stream Buffers"]
[]
["BACKGROUND INFORMATION  ",null,null,null,null,null,null,null,null,null,null,null,null," Total Stream Gains from Buffers (Functional Feet)"]
["Corps Project ID #:",null,null,null,null,null,"Corps PM:"]
["Project Name:",null,null,null,null,null,"Date:",null,null,null,null,null,null,{"$f":"SUM(M11:M64)","v":0}]
["Lat/Long:",null,null,null,null,null,"Sponsor:"]
["County:",null,null,null,null,null,"Collaborators: "]
["Raw Change in Buffer Value",null,null,null,null,null,null,null,null,"Adjustments",null,null,"Stream Gains (Functional Feet)","REMARKS                       (include CSBA Coordinates)"]
["Credited Stream Buffer Area Name (CBSA)",null,"Activity","Evaluation","Buffer Area (Acres)","Buffer Quality","Quality Acres","Raw Buffer Value (Functional Feet)","Raw Change in Buffer Value (Functional Feet)","Site Sensitivity","Site Protection"]
[]
[null,null,"Preliminary Resource Eval","Existing Buffer",null,null,{"$f":"E11*F11","v":0},{"$f":"G11*75","v":0},{"$f":"H12-H11","v":0},0,"Existing: Select From Dropdown","Proposed: Select From Dropdown",{"$f":"IF(C12=\"Preservation\", (H12+J13+K13)*0.25, SUM(I11,J13,K13))","v":0}]
[null,null,"Select from Dropdown","Proposed Buffer",null,null,{"$f":"E12*F12","v":0},{"$f":"G12*75","v":0},null,null,{"$f":"IF(AND(K11=\"No Existing Protection\",L11=\"Deed Restriction\"), 0.02, IF(AND(K11=\"No Existing Protection\",L11=\"Easement\"), 0.05, IF(AND(K11=\"No Existing Protection\", L11=\"Accredited Easement\"), 0.07, IF(AND(K11=\"No Existing Protection\", L11=\"Fee Simple to Conservation Holder\"), 0.09, IF(AND(K11=\"Agricultural Easement\",L11=\"Deed Restriction\"), 0.01, IF(AND(K11=\"Agricultural Easement\",L11=\"Easement\"), 0.04, IF(AND(K11=\"Agricultural Easement\", L11=\"Accredited Easement\"), 0.06, IF(AND(K11=\"Agricultural Easement\", L11=\"Fee Simple to Conservation Holder\"), 0.09, IF(AND(K11=\"Environmental Easement\",L11=\"Deed Restriction\"), 0, IF(AND(K11=\"Environmental Easement\", L11=\"Easement\"), 0.02, IF(AND(K11=\"Environmental Easement\", L11=\"Accredited Easement\"), 0.03, IF(AND(K11=\"Public Land\", L11=\"Public Land MOA\"), 0.02, 0))))))))))))","v":0}]
[null,null,null,null,null,null,null,null,null,{"$f":"IF(C12=\"Preservation\",((H11*0.1*J11)),I11*J11)","v":0},{"$f":"H12*K12","v":0}]
[null,null,"Preliminary Resource Eval","Existing Buffer",null,null,{"$f":"E14*F14","v":0},{"$f":"G14*75","v":0},{"$f":"H15-H14","v":0},0,"Existing: Select From Dropdown","Proposed: Select From Dropdown",{"$f":"IF(C15=\"Preservation\", (H15+J16+K16)*0.25, SUM(I14,J16,K16))","v":0}]
[null,null,"Select from Dropdown","Proposed Buffer",null,null,{"$f":"E15*F15","v":0},{"$f":"G15*75","v":0},null,null,{"$f":"IF(AND(K14=\"No Existing Protection\",L14=\"Deed Restriction\"), 0.02, IF(AND(K14=\"No Existing Protection\",L14=\"Easement\"), 0.05, IF(AND(K14=\"No Existing Protection\", L14=\"Accredited Easement\"), 0.07, IF(AND(K14=\"No Existing Protection\", L14=\"Fee Simple to Conservation Holder\"), 0.09, IF(AND(K14=\"Agricultural Easement\",L14=\"Deed Restriction\"), 0.01, IF(AND(K14=\"Agricultural Easement\",L14=\"Easement\"), 0.04, IF(AND(K14=\"Agricultural Easement\", L14=\"Accredited Easement\"), 0.06, IF(AND(K14=\"Agricultural Easement\", L14=\"Fee Simple to Conservation Holder\"), 0.09, IF(AND(K14=\"Environmental Easement\",L14=\"Deed Restriction\"), 0, IF(AND(K14=\"Environmental Easement\", L14=\"Easement\"), 0.02, IF(AND(K14=\"Environmental Easement\", L14=\"Accredited Easement\"), 0.03, IF(AND(K14=\"Public Land\", L14=\"Public Land MOA\"), 0.02, 0))))))))))))","v":0}]
[null,null,null,null,null,null,null,null,null,{"$f":"IF(C15=\"Preservation\",((H14*0.1*J14)),I14*J14)","v":0},{"$f":"H15*K15","v":0}]
[null,null,"Preliminary Resource Eval","Existing Buffer",null,null,{"$f":"E17*F17","v":0},{"$f":"G17*75","v":0},{"$f":"H18-H17","v":0},0,"Existing: Select From Dropdown","Proposed: Select From Dropdown",{"$f":"IF(C18=\"Preservation\", (H18+J19+K19)*0.25, SUM(I17,J19,K19))","v":0}]
[null,null,"Select from Dropdown","Proposed Buffer",null,null,{"$f":"E18*F18","v":0},{"$f":"G18*75","v":0},null,null,{"$f":"IF(AND(K17=\"No Existing Protection\",L17=\"Deed Restriction\"), 0.02, IF(AND(K17=\"No Existing Protection\",L17=\"Easement\"), 0.05, IF(AND(K17=\"No Existing Protection\", L17=\"Accredited Easement\"), 0.07, IF(AND(K17=\"No Existing Protection\", L17=\"Fee Simple to Conservation Holder\"), 0.09, IF(AND(K17=\"Agricultural Easement\",L17=\"Deed Restriction\"), 0.01, IF(AND(K17=\"Agricultural Easement\",L17=\"Easement\"), 0.04, IF(AND(K17=\"Agricultural Easement\", L17=\"Accredited Easement\"), 0.06, IF(AND(K17=\"Agricultural Easement\", L17=\"Fee Simple to Conservation Holder\"), 0.09, IF(AND(K17=\"Environmental Easement\",L17=\"Deed Restriction\"), 0, IF(AND(K17=\"Environmental Easement\", L17=\"Easement\"), 0.02, IF(AND(K17=\"Environmental Easement\", L17=\"Accredited Easement\"), 0.03, IF(AND(K17=\"Public Land\", L17=\"Public Land MOA\"), 0.02, 0))))))))))))","v":0}]
[null,null,null,null,null,null,null,null,null,{"$f":"IF(C18=\"Preservation\",((H17*0.1*J18)),I17*J18)","v":0},{"$f":"H18*K18","v":0}]
[null,null,"Preliminary Resource Eval","Existing Buffer",null,null,{"$f":"E20*F20","v":0},{"$f":"G20*75","v":0},{"$f":"H21-H20","v":0},0,"Existing: Select From Dropdown","Proposed: Select From Dropdown",{"$f":"IF(C21=\"Preservation\", (H21+J22+K22)*0.25, SUM(I20,J22,K22))","v":0}]
[null,null,"Select from Dropdown","Proposed Buffer",null,null,0,0,null,null,{"$f":"IF(AND(K20=\"No Existing Protection\",L20=\"Deed Restriction\"), 0.02, IF(AND(K20=\"No Existing Protection\",L20=\"Easement\"), 0.05, IF(AND(K20=\"No Existing Protection\", L20=\"Accredited Easement\"), 0.07, IF(AND(K20=\"No Existing Protection\", L20=\"Fee Simple to Conservation Holder\"), 0.09, IF(AND(K20=\"Agricultural Easement\",L20=\"Deed Restriction\"), 0.01, IF(AND(K20=\"Agricultural Easement\",L20=\"Easement\"), 0.04, IF(AND(K20=\"Agricultural Easement\", L20=\"Accredited Easement\"), 0.06, IF(AND(K20=\"Agricultural Easement\", L20=\"Fee Simple to Conservation Holder\"), 0.09, IF(AND(K20=\"Environmental Easement\",L20=\"Deed Restriction\"), 0, IF(AND(K20=\"Environmental Easement\", L20=\"Easement\"), 0.02, IF(AND(K20=\"Environmental Easement\", L20=\"Accredited Easement\"), 0.03, IF(AND(K20=\"Public Land\", L20=\"Public Land MOA\"), 0.02, 0))))))))))))","v":0}]
[null,null,null,null,null,null,null,null,null,{"$f":"IF(C21=\"Preservation\",((H20*0.1*J21)),I20*J21)","v":0},{"$f":"H21*K21","v":0}]
[null,null,"Preliminary Resource Eval","Existing Buffer",null,null,{"$f":"E23*F23","v":0},{"$f":"G23*75","v":0},{"$f":"H24-H23","v":0},0,"Existing: Select From Dropdown","Proposed: Select From Dropdown",{"$f":"IF(C24=\"Preservation\", (H24+J25+K25)*0.25, SUM(I23,J25,K25))","v":0}]
[null,null,"Select from Dropdown","Proposed Buffer",null,null,0,0,null,null,{"$f":"IF(AND(K23=\"No Existing Protection\",L23=\"Deed Restriction\"), 0.02, IF(AND(K23=\"No Existing Protection\",L23=\"Easement\"), 0.05, IF(AND(K23=\"No Existing Protection\", L23=\"Accredited Easement\"), 0.07, IF(AND(K23=\"No Existing Protection\", L23=\"Fee Simple to Conservation Holder\"), 0.09, IF(AND(K23=\"Agricultural Easement\",L23=\"Deed Restriction\"), 0.01, IF(AND(K23=\"Agricultural Easement\",L23=\"Easement\"), 0.04, IF(AND(K23=\"Agricultural Easement\", L23=\"Accredited Easement\"), 0.06, IF(AND(K23=\"Agricultural Easement\", L23=\"Fee Simple to Conservation Holder\"), 0.09, IF(AND(K23=\"Environmental Easement\",L23=\"Deed Restriction\"), 0, IF(AND(K23=\"Environmental Easement\", L23=\"Easement\"), 0.02, IF(AND(K23=\"Environmental Easement\", L23=\"Accredited Easement\"), 0.03, IF(AND(K23=\"Public Land\", L23=\"Public Land MOA\"), 0.02, 0))))))))))))","v":0}]
[null,null,null,null,null,null,null,null,null,{"$f":"IF(C24=\"Preservation\",((H23*0.1*J24)),I23*J24)","v":0},{"$f":"H24*K24","v":0}]
[null,null,"Preliminary Resource Eval","Existing Buffer",null,null,{"$f":"E26*F26","v":0},{"$f":"G26*75","v":0},{"$f":"H27-H26","v":0},0,"Existing: Select From Dropdown","Proposed: Select From Dropdown",{"$f":"IF(C27=\"Preservation\", (H27+J28+K28)*0.25, SUM(I26,J28,K28))","v":0}]
[null,null,"Select from Dropdown","Proposed Buffer",null,null,0,0,null,null,{"$f":"IF(AND(K26=\"No Existing Protection\",L26=\"Deed Restriction\"), 0.02, IF(AND(K26=\"No Existing Protection\",L26=\"Easement\"), 0.05, IF(AND(K26=\"No Existing Protection\", L26=\"Accredited Easement\"), 0.07, IF(AND(K26=\"No Existing Protection\", L26=\"Fee Simple to Conservation Holder\"), 0.09, IF(AND(K26=\"Agricultural Easement\",L26=\"Deed Restriction\"), 0.01, IF(AND(K26=\"Agricultural Easement\",L26=\"Easement\"), 0.04, IF(AND(K26=\"Agricultural Easement\", L26=\"Accredited Easement\"), 0.06, IF(AND(K26=\"Agricultural Easement\", L26=\"Fee Simple to Conservation Holder\"), 0.09, IF(AND(K26=\"Environmental Easement\",L26=\"Deed Restriction\"), 0, IF(AND(K26=\"Environmental Easement\", L26=\"Easement\"), 0.02, IF(AND(K26=\"Environmental Easement\", L26=\"Accredited Easement\"), 0.03, IF(AND(K26=\"Public Land\", L26=\"Public Land MOA\"), 0.02, 0))))))))))))","v":0}]
[null,null,null,null,null,null,null,null,null,{"$f":"IF(C27=\"Preservation\",((H26*0.1*J27)),I26*J27)","v":0},{"$f":"H27*K27","v":0}]
[null,null,"Preliminary Resource Eval","Existing Buffer",null,null,{"$f":"E29*F29","v":0},{"$f":"G29*75","v":0},{"$f":"H30-H29","v":0},0,"Existing: Select From Dropdown","Proposed: Select From Dropdown",{"$f":"IF(C30=\"Preservation\", (H30+J31+K31)*0.25, SUM(I29,J31,K31))","v":0}]
[null,null,"Select from Dropdown","Proposed Buffer",null,null,0,0,null,null,{"$f":"IF(AND(K29=\"No Existing Protection\",L29=\"Deed Restriction\"), 0.02, IF(AND(K29=\"No Existing Protection\",L29=\"Easement\"), 0.05, IF(AND(K29=\"No Existing Protection\", L29=\"Accredited Easement\"), 0.07, IF(AND(K29=\"No Existing Protection\", L29=\"Fee Simple to Conservation Holder\"), 0.09, IF(AND(K29=\"Agricultural Easement\",L29=\"Deed Restriction\"), 0.01, IF(AND(K29=\"Agricultural Easement\",L29=\"Easement\"), 0.04, IF(AND(K29=\"Agricultural Easement\", L29=\"Accredited Easement\"), 0.06, IF(AND(K29=\"Agricultural Easement\", L29=\"Fee Simple to Conservation Holder\"), 0.09, IF(AND(K29=\"Environmental Easement\",L29=\"Deed Restriction\"), 0, IF(AND(K29=\"Environmental Easement\", L29=\"Easement\"), 0.02, IF(AND(K29=\"Environmental Easement\", L29=\"Accredited Easement\"), 0.03, IF(AND(K29=\"Public Land\", L29=\"Public Land MOA\"), 0.02, 0))))))))))))","v":0}]
[null,null,null,null,null,null,null,null,null,{"$f":"IF(C30=\"Preservation\",((H29*0.1*J30)),I29*J30)","v":0},{"$f":"H30*K30","v":0}]
[null,null,"Preliminary Resource Eval","Existing Buffer",null,null,{"$f":"E32*F32","v":0},{"$f":"G32*75","v":0},{"$f":"H33-H32","v":0},0,"Existing: Select From Dropdown","Proposed: Select From Dropdown",{"$f":"IF(C33=\"Preservation\", (H33+J34+K34)*0.25, SUM(I32,J34,K34))","v":0}]
[null,null,"Select from Dropdown","Proposed Buffer",null,null,0,0,null,null,{"$f":"IF(AND(K32=\"No Existing Protection\",L32=\"Deed Restriction\"), 0.02, IF(AND(K32=\"No Existing Protection\",L32=\"Easement\"), 0.05, IF(AND(K32=\"No Existing Protection\", L32=\"Accredited Easement\"), 0.07, IF(AND(K32=\"No Existing Protection\", L32=\"Fee Simple to Conservation Holder\"), 0.09, IF(AND(K32=\"Agricultural Easement\",L32=\"Deed Restriction\"), 0.01, IF(AND(K32=\"Agricultural Easement\",L32=\"Easement\"), 0.04, IF(AND(K32=\"Agricultural Easement\", L32=\"Accredited Easement\"), 0.06, IF(AND(K32=\"Agricultural Easement\", L32=\"Fee Simple to Conservation Holder\"), 0.09, IF(AND(K32=\"Environmental Easement\",L32=\"Deed Restriction\"), 0, IF(AND(K32=\"Environmental Easement\", L32=\"Easement\"), 0.02, IF(AND(K32=\"Environmental Easement\", L32=\"Accredited Easement\"), 0.03, IF(AND(K32=\"Public Land\", L32=\"Public Land MOA\"), 0.02, 0))))))))))))","v":0}]
[null,null,null,null,null,null,null,null,null,{"$f":"IF(C33=\"Preservation\",((H32*0.1*J33)),I32*J33)","v":0},{"$f":"H33*K33","v":0}]
[null,null,"Preliminary Resource Eval","Existing Buffer",null,null,{"$f":"E35*F35","v":0},{"$f":"G35*75","v":0},{"$f":"H36-H35","v":0},0,"Existing: Select From Dropdown","Proposed: Select From Dropdown",{"$f":"IF(C36=\"Preservation\", (H36+J37+K37)*0.25, SUM(I35,J37,K37))","v":0}]
[null,null,"Select from Dropdown","Proposed Buffer",null,null,0,0,null,null,{"$f":"IF(AND(K35=\"No Existing Protection\",L35=\"Deed Restriction\"), 0.02, IF(AND(K35=\"No Existing Protection\",L35=\"Easement\"), 0.05, IF(AND(K35=\"No Existing Protection\", L35=\"Accredited Easement\"), 0.07, IF(AND(K35=\"No Existing Protection\", L35=\"Fee Simple to Conservation Holder\"), 0.09, IF(AND(K35=\"Agricultural Easement\",L35=\"Deed Restriction\"), 0.01, IF(AND(K35=\"Agricultural Easement\",L35=\"Easement\"), 0.04, IF(AND(K35=\"Agricultural Easement\", L35=\"Accredited Easement\"), 0.06, IF(AND(K35=\"Agricultural Easement\", L35=\"Fee Simple to Conservation Holder\"), 0.09, IF(AND(K35=\"Environmental Easement\",L35=\"Deed Restriction\"), 0, IF(AND(K35=\"Environmental Easement\", L35=\"Easement\"), 0.02, IF(AND(K35=\"Environmental Easement\", L35=\"Accredited Easement\"), 0.03, IF(AND(K35=\"Public Land\", L35=\"Public Land MOA\"), 0.02, 0))))))))))))","v":0}]
[null,null,null,null,null,null,null,null,null,{"$f":"IF(C36=\"Preservation\",((H35*0.1*J36)),I35*J36)","v":0},{"$f":"H36*K36","v":0}]
[null,null,"Preliminary Resource Eval","Existing Buffer",null,null,{"$f":"E38*F38","v":0},{"$f":"G38*75","v":0},{"$f":"H39-H38","v":0},0,"Existing: Select From Dropdown","Proposed: Select From Dropdown",{"$f":"IF(C39=\"Preservation\", (H39+J40+K40)*0.25, SUM(I38,J40,K40))","v":0}]
[null,null,"Select from Dropdown","Proposed Buffer",null,null,0,0,null,null,{"$f":"IF(AND(K38=\"No Existing Protection\",L38=\"Deed Restriction\"), 0.02, IF(AND(K38=\"No Existing Protection\",L38=\"Easement\"), 0.05, IF(AND(K38=\"No Existing Protection\", L38=\"Accredited Easement\"), 0.07, IF(AND(K38=\"No Existing Protection\", L38=\"Fee Simple to Conservation Holder\"), 0.09, IF(AND(K38=\"Agricultural Easement\",L38=\"Deed Restriction\"), 0.01, IF(AND(K38=\"Agricultural Easement\",L38=\"Easement\"), 0.04, IF(AND(K38=\"Agricultural Easement\", L38=\"Accredited Easement\"), 0.06, IF(AND(K38=\"Agricultural Easement\", L38=\"Fee Simple to Conservation Holder\"), 0.09, IF(AND(K38=\"Environmental Easement\",L38=\"Deed Restriction\"), 0, IF(AND(K38=\"Environmental Easement\", L38=\"Easement\"), 0.02, IF(AND(K38=\"Environmental Easement\", L38=\"Accredited Easement\"), 0.03, IF(AND(K38=\"Public Land\", L38=\"Public Land MOA\"), 0.02, 0))))))))))))","v":0}]
[null,null,null,null,null,null,null,null,null,{"$f":"IF(C39=\"Preservation\",((H38*0.1*J39)),I38*J39)","v":0},{"$f":"H39*K39","v":0}]
[null,null,"Preliminary Resource Eval","Existing Buffer",null,null,{"$f":"E41*F41","v":0},{"$f":"G41*75","v":0},{"$f":"H42-H41","v":0},0,"Existing: Select From Dropdown","Proposed: Select From Dropdown",{"$f":"IF(C42=\"Preservation\", (H42+J43+K43)*0.25, SUM(I41,J43,K43))","v":0}]
[null,null,"Select from Dropdown","Proposed Buffer",null,null,0,0,null,null,{"$f":"IF(AND(K41=\"No Existing Protection\",L41=\"Deed Restriction\"), 0.02, IF(AND(K41=\"No Existing Protection\",L41=\"Easement\"), 0.05, IF(AND(K41=\"No Existing Protection\", L41=\"Accredited Easement\"), 0.07, IF(AND(K41=\"No Existing Protection\", L41=\"Fee Simple to Conservation Holder\"), 0.09, IF(AND(K41=\"Agricultural Easement\",L41=\"Deed Restriction\"), 0.01, IF(AND(K41=\"Agricultural Easement\",L41=\"Easement\"), 0.04, IF(AND(K41=\"Agricultural Easement\", L41=\"Accredited Easement\"), 0.06, IF(AND(K41=\"Agricultural Easement\", L41=\"Fee Simple to Conservation Holder\"), 0.09, IF(AND(K41=\"Environmental Easement\",L41=\"Deed Restriction\"), 0, IF(AND(K41=\"Environmental Easement\", L41=\"Easement\"), 0.02, IF(AND(K41=\"Environmental Easement\", L41=\"Accredited Easement\"), 0.03, IF(AND(K41=\"Public Land\", L41=\"Public Land MOA\"), 0.02, 0))))))))))))","v":0}]
[null,null,null,null,null,null,null,null,null,{"$f":"IF(C42=\"Preservation\",((H41*0.1*J42)),I41*J42)","v":0},{"$f":"H42*K42","v":0}]
[null,null,"Preliminary Resource Eval","Existing Buffer",null,null,{"$f":"E44*F44","v":0},{"$f":"G44*75","v":0},{"$f":"H45-H44","v":0},0,"Existing: Select From Dropdown","Proposed: Select From Dropdown",{"$f":"IF(C45=\"Preservation\", (H45+J46+K46)*0.25, SUM(I44,J46,K46))","v":0}]
[null,null,"Select from Dropdown","Proposed Buffer",null,null,0,0,null,null,{"$f":"IF(AND(K44=\"No Existing Protection\",L44=\"Deed Restriction\"), 0.02, IF(AND(K44=\"No Existing Protection\",L44=\"Easement\"), 0.05, IF(AND(K44=\"No Existing Protection\", L44=\"Accredited Easement\"), 0.07, IF(AND(K44=\"No Existing Protection\", L44=\"Fee Simple to Conservation Holder\"), 0.09, IF(AND(K44=\"Agricultural Easement\",L44=\"Deed Restriction\"), 0.01, IF(AND(K44=\"Agricultural Easement\",L44=\"Easement\"), 0.04, IF(AND(K44=\"Agricultural Easement\", L44=\"Accredited Easement\"), 0.06, IF(AND(K44=\"Agricultural Easement\", L44=\"Fee Simple to Conservation Holder\"), 0.09, IF(AND(K44=\"Environmental Easement\",L44=\"Deed Restriction\"), 0, IF(AND(K44=\"Environmental Easement\", L44=\"Easement\"), 0.02, IF(AND(K44=\"Environmental Easement\", L44=\"Accredited Easement\"), 0.03, IF(AND(K44=\"Public Land\", L44=\"Public Land MOA\"), 0.02, 0))))))))))))","v":0}]
[null,null,null,null,null,null,null,null,null,{"$f":"IF(C45=\"Preservation\",((H44*0.1*J45)),I44*J45)","v":0},{"$f":"H45*K45","v":0}]
[null,null,"Preliminary Resource Eval","Existing Buffer",null,null,{"$f":"E47*F47","v":0},{"$f":"G47*75","v":0},{"$f":"H48-H47","v":0},0,"Existing: Select From Dropdown","Proposed: Select From Dropdown",{"$f":"IF(C48=\"Preservation\", (H48+J49+K49)*0.25, SUM(I47,J49,K49))","v":0}]
[null,null,"Select from Dropdown","Proposed Buffer",null,null,0,0,null,null,{"$f":"IF(AND(K47=\"No Existing Protection\",L47=\"Deed Restriction\"), 0.02, IF(AND(K47=\"No Existing Protection\",L47=\"Easement\"), 0.05, IF(AND(K47=\"No Existing Protection\", L47=\"Accredited Easement\"), 0.07, IF(AND(K47=\"No Existing Protection\", L47=\"Fee Simple to Conservation Holder\"), 0.09, IF(AND(K47=\"Agricultural Easement\",L47=\"Deed Restriction\"), 0.01, IF(AND(K47=\"Agricultural Easement\",L47=\"Easement\"), 0.04, IF(AND(K47=\"Agricultural Easement\", L47=\"Accredited Easement\"), 0.06, IF(AND(K47=\"Agricultural Easement\", L47=\"Fee Simple to Conservation Holder\"), 0.09, IF(AND(K47=\"Environmental Easement\",L47=\"Deed Restriction\"), 0, IF(AND(K47=\"Environmental Easement\", L47=\"Easement\"), 0.02, IF(AND(K47=\"Environmental Easement\", L47=\"Accredited Easement\"), 0.03, IF(AND(K47=\"Public Land\", L47=\"Public Land MOA\"), 0.02, 0))))))))))))","v":0}]
[null,null,null,null,null,null,null,null,null,{"$f":"IF(C48=\"Preservation\",((H47*0.1*J48)),I47*J48)","v":0},{"$f":"H48*K48","v":0}]
[null,null,"Preliminary Resource Eval","Existing Buffer",null,null,{"$f":"E50*F50","v":0},{"$f":"G50*75","v":0},{"$f":"H51-H50","v":0},0,"Existing: Select From Dropdown","Proposed: Select From Dropdown",{"$f":"IF(C51=\"Preservation\", (H51+J52+K52)*0.25, SUM(I50,J52,K52))","v":0}]
[null,null,"Select from Dropdown","Proposed Buffer",null,null,0,0,null,null,{"$f":"IF(AND(K50=\"No Existing Protection\",L50=\"Deed Restriction\"), 0.02, IF(AND(K50=\"No Existing Protection\",L50=\"Easement\"), 0.05, IF(AND(K50=\"No Existing Protection\", L50=\"Accredited Easement\"), 0.07, IF(AND(K50=\"No Existing Protection\", L50=\"Fee Simple to Conservation Holder\"), 0.09, IF(AND(K50=\"Agricultural Easement\",L50=\"Deed Restriction\"), 0.01, IF(AND(K50=\"Agricultural Easement\",L50=\"Easement\"), 0.04, IF(AND(K50=\"Agricultural Easement\", L50=\"Accredited Easement\"), 0.06, IF(AND(K50=\"Agricultural Easement\", L50=\"Fee Simple to Conservation Holder\"), 0.09, IF(AND(K50=\"Environmental Easement\",L50=\"Deed Restriction\"), 0, IF(AND(K50=\"Environmental Easement\", L50=\"Easement\"), 0.02, IF(AND(K50=\"Environmental Easement\", L50=\"Accredited Easement\"), 0.03, IF(AND(K50=\"Public Land\", L50=\"Public Land MOA\"), 0.02, 0))))))))))))","v":0}]
[null,null,null,null,null,null,null,null,null,{"$f":"IF(C51=\"Preservation\",((H50*0.1*J51)),I50*J51)","v":0},{"$f":"H51*K51","v":0}]
[null,null,"Preliminary Resource Eval","Existing Buffer",null,null,{"$f":"E53*F53","v":0},{"$f":"G53*75","v":0},{"$f":"H54-H53","v":0},0,"Existing: Select From Dropdown","Proposed: Select From Dropdown",{"$f":"IF(C54=\"Preservation\", (H54+J55+K55)*0.25, SUM(I53,J55,K55))","v":0}]
[null,null,"Select from Dropdown","Proposed Buffer",null,null,0,0,null,null,{"$f":"IF(AND(K53=\"No Existing Protection\",L53=\"Deed Restriction\"), 0.02, IF(AND(K53=\"No Existing Protection\",L53=\"Easement\"), 0.05, IF(AND(K53=\"No Existing Protection\", L53=\"Accredited Easement\"), 0.07, IF(AND(K53=\"No Existing Protection\", L53=\"Fee Simple to Conservation Holder\"), 0.09, IF(AND(K53=\"Agricultural Easement\",L53=\"Deed Restriction\"), 0.01, IF(AND(K53=\"Agricultural Easement\",L53=\"Easement\"), 0.04, IF(AND(K53=\"Agricultural Easement\", L53=\"Accredited Easement\"), 0.06, IF(AND(K53=\"Agricultural Easement\", L53=\"Fee Simple to Conservation Holder\"), 0.09, IF(AND(K53=\"Environmental Easement\",L53=\"Deed Restriction\"), 0, IF(AND(K53=\"Environmental Easement\", L53=\"Easement\"), 0.02, IF(AND(K53=\"Environmental Easement\", L53=\"Accredited Easement\"), 0.03, IF(AND(K53=\"Public Land\", L53=\"Public Land MOA\"), 0.02, 0))))))))))))","v":0}]
[null,null,null,null,null,null,null,null,null,{"$f":"IF(C54=\"Preservation\",((H53*0.1*J54)),I53*J54)","v":0},{"$f":"H54*K54","v":0}]
[null,null,"Preliminary Resource Eval","Existing Buffer",null,null,{"$f":"E56*F56","v":0},{"$f":"G56*75","v":0},{"$f":"H57-H56","v":0},0,"Existing: Select From Dropdown","Proposed: Select From Dropdown",{"$f":"IF(C57=\"Preservation\", (H57+J58+K58)*0.25, SUM(I56,J58,K58))","v":0}]
[null,null,"Select from Dropdown","Proposed Buffer",null,null,0,0,null,null,{"$f":"IF(AND(K56=\"No Existing Protection\",L56=\"Deed Restriction\"), 0.02, IF(AND(K56=\"No Existing Protection\",L56=\"Easement\"), 0.05, IF(AND(K56=\"No Existing Protection\", L56=\"Accredited Easement\"), 0.07, IF(AND(K56=\"No Existing Protection\", L56=\"Fee Simple to Conservation Holder\"), 0.09, IF(AND(K56=\"Agricultural Easement\",L56=\"Deed Restriction\"), 0.01, IF(AND(K56=\"Agricultural Easement\",L56=\"Easement\"), 0.04, IF(AND(K56=\"Agricultural Easement\", L56=\"Accredited Easement\"), 0.06, IF(AND(K56=\"Agricultural Easement\", L56=\"Fee Simple to Conservation Holder\"), 0.09, IF(AND(K56=\"Environmental Easement\",L56=\"Deed Restriction\"), 0, IF(AND(K56=\"Environmental Easement\", L56=\"Easement\"), 0.02, IF(AND(K56=\"Environmental Easement\", L56=\"Accredited Easement\"), 0.03, IF(AND(K56=\"Public Land\", L56=\"Public Land MOA\"), 0.02, 0))))))))))))","v":0}]
[null,null,null,null,null,null,null,null,null,{"$f":"IF(C57=\"Preservation\",((H56*0.1*J57)),I56*J57)","v":0},{"$f":"H57*K57","v":0}]
[null,null,"Preliminary Resource Eval","Existing Buffer",null,null,{"$f":"E59*F59","v":0},{"$f":"G59*75","v":0},{"$f":"H60-H59","v":0},0,"Existing: Select From Dropdown","Proposed: Select From Dropdown",{"$f":"IF(C60=\"Preservation\", (H60+J61+K61)*0.25, SUM(I59,J61,K61))","v":0}]
[null,null,"Select from Dropdown","Proposed Buffer",null,null,0,0,null,null,{"$f":"IF(AND(K59=\"No Existing Protection\",L59=\"Deed Restriction\"), 0.02, IF(AND(K59=\"No Existing Protection\",L59=\"Easement\"), 0.05, IF(AND(K59=\"No Existing Protection\", L59=\"Accredited Easement\"), 0.07, IF(AND(K59=\"No Existing Protection\", L59=\"Fee Simple to Conservation Holder\"), 0.09, IF(AND(K59=\"Agricultural Easement\",L59=\"Deed Restriction\"), 0.01, IF(AND(K59=\"Agricultural Easement\",L59=\"Easement\"), 0.04, IF(AND(K59=\"Agricultural Easement\", L59=\"Accredited Easement\"), 0.06, IF(AND(K59=\"Agricultural Easement\", L59=\"Fee Simple to Conservation Holder\"), 0.09, IF(AND(K59=\"Environmental Easement\",L59=\"Deed Restriction\"), 0, IF(AND(K59=\"Environmental Easement\", L59=\"Easement\"), 0.02, IF(AND(K59=\"Environmental Easement\", L59=\"Accredited Easement\"), 0.03, IF(AND(K59=\"Public Land\", L59=\"Public Land MOA\"), 0.02, 0))))))))))))","v":0}]
[null,null,null,null,null,null,null,null,null,{"$f":"IF(C60=\"Preservation\",((H59*0.1*J60)),I59*J60)","v":0},{"$f":"H60*K60","v":0}]
[null,null,"Preliminary Resource Eval","Existing Buffer",null,null,{"$f":"E62*F62","v":0},{"$f":"G62*75","v":0},{"$f":"H63-H62","v":0},0,"Existing: Select From Dropdown","Proposed: Select From Dropdown",{"$f":"IF(C63=\"Preservation\", (H63+J64+K64)*0.25, SUM(I62,J64,K64))","v":0}]
[null,null,"Select from Dropdown","Proposed Buffer",null,null,0,0,null,null,{"$f":"IF(AND(K62=\"No Existing Protection\",L62=\"Deed Restriction\"), 0.02, IF(AND(K62=\"No Existing Protection\",L62=\"Easement\"), 0.05, IF(AND(K62=\"No Existing Protection\", L62=\"Accredited Easement\"), 0.07, IF(AND(K62=\"No Existing Protection\", L62=\"Fee Simple to Conservation Holder\"), 0.09, IF(AND(K62=\"Agricultural Easement\",L62=\"Deed Restriction\"), 0.01, IF(AND(K62=\"Agricultural Easement\",L62=\"Easement\"), 0.04, IF(AND(K62=\"Agricultural Easement\", L62=\"Accredited Easement\"), 0.06, IF(AND(K62=\"Agricultural Easement\", L62=\"Fee Simple to Conservation Holder\"), 0.09, IF(AND(K62=\"Environmental Easement\",L62=\"Deed Restriction\"), 0, IF(AND(K62=\"Environmental Easement\", L62=\"Easement\"), 0.02, IF(AND(K62=\"Environmental Easement\", L62=\"Accredited Easement\"), 0.03, IF(AND(K62=\"Public Land\", L62=\"Public Land MOA\"), 0.02, 0))))))))))))","v":0}]
[null,null,null,null,null,null,null,null,null,{"$f":"IF(C63=\"Preservation\",((H62*0.1*J63)),I62*J63)","v":0},{"$f":"H63*K63","v":0}]